Paperback
type: BookFormatType
comment: A flexible, lightweight book bound with a thick paper or cardstock cover and glued spine, prioritizing portability and affordability over long-term durability.

CompositeCaptureDigitalSource
type: IPTCDigitalSourceEnumeration
comment: Content coded as 'composite capture' using the IPTC digital source type vocabulary.
isPartOf: pending.schema.org
source: https://github.com/schemaorg/schemaorg/issues/3392

AnaerobicActivity
type: PhysicalActivityCategory
comment: Physical activity that is of high-intensity which utilizes the anaerobic metabolism of the body.
isPartOf: health-lifesci.schema.org

episodes
type: Property
comment: An episode of a TV/radio series or season.
domainIncludes: VideoGameSeries
domainIncludes: RadioSeries
domainIncludes: TVSeries
domainIncludes: CreativeWorkSeason
rangeIncludes: Episode
supersededBy: episode

deathDate
type: Property
comment: Date of death.
domainIncludes: Person
rangeIncludes: Date

replacee
type: Property
comment: A sub property of object. The object that is being replaced.
sub property of: object
domainIncludes: ReplaceAction
rangeIncludes: Thing

PrimaryCare
type: MedicalSpecialty
comment: The medical care by a physician, or other health-care professional, who is the patient's first contact with the health-care system and who may recommend a specialist if necessary.
subclass of: MedicalBusiness
isPartOf: health-lifesci.schema.org

availableStrength
type: Property
comment: An available dosage strength for the drug.
domainIncludes: Drug
isPartOf: health-lifesci.schema.org
rangeIncludes: DrugStrength

yearBuilt
type: Property
comment: The year an Accommodation was constructed. This corresponds to the [YearBuilt field in RESO](https://ddwiki.reso.org/display/DDW17/YearBuilt+Field).
domainIncludes: Accommodation
isPartOf: pending.schema.org
rangeIncludes: Number
source: https://github.com/schemaorg/schemaorg/issues/2373

tocEntry
type: Property
comment: Indicates a HyperTocEntry in a HyperToc.
sub property of: hasPart
domainIncludes: HyperToc
isPartOf: pending.schema.org
rangeIncludes: HyperTocEntry
source: https://github.com/schemaorg/schemaorg/issues/2766

AutoBodyShop
type: Class
comment: Auto body shop.
subclass of: AutomotiveBusiness

CafeOrCoffeeShop
type: Class
comment: A cafe or coffee shop.
subclass of: FoodEstablishment

cvdNumVentUse
type: Property
comment: numventuse - MECHANICAL VENTILATORS IN USE: Total number of ventilators in use.
domainIncludes: CDCPMDRecord
isPartOf: pending.schema.org
rangeIncludes: Number
source: https://github.com/schemaorg/schemaorg/issues/2521

courseSchedule
type: Property
comment: Represents the length and pace of a course, expressed as a Schedule.
domainIncludes: CourseInstance
isPartOf: pending.schema.org
rangeIncludes: Schedule
source: https://github.com/schemaorg/schemaorg/issues/3281

InstallAction
type: Class
comment: The act of installing an application.
subclass of: ConsumeAction

companyRegistration
type: Property
comment: The official registration information of a business including the organization that issued it such as Company House or Chamber of Commerce in form of a Certification.
domainIncludes: Organization
rangeIncludes: Certification

orderPercentage
type: Property
comment: Value representing the fraction of the value of the order that is charged as shipping cost. Example: 0.10 would mean shipping rate is 10% of the total order value.
domainIncludes: ShippingRateSettings
isPartOf: pending.schema.org
rangeIncludes: Number
source: https://github.com/schemaorg/schemaorg/issues/3617

LandmarksOrHistoricalBuildings
type: Class
comment: An historical landmark or building.
subclass of: Place

Mass
type: Class
comment: Properties that take Mass as values are of the form '<Number> <Mass unit of measure>'. E.g., '7 kg'.
subclass of: Quantity

NoninvasiveProcedure
type: MedicalProcedureType
comment: A type of medical procedure that involves noninvasive techniques.
isPartOf: health-lifesci.schema.org

TaxiService
type: Class
comment: A service for a vehicle for hire with a driver for local travel. Fares are usually calculated based on distance traveled.
subclass of: Service

educationalUse
type: Property
comment: The purpose of a work in the context of education; for example, 'assignment', 'group work'.
domainIncludes: LearningResource
domainIncludes: CreativeWork
rangeIncludes: DefinedTerm
rangeIncludes: Text

HowOrWhereHealthAspect
type: HealthAspectEnumeration
comment: Information about how or where to find a topic. Also may contain location data that can be used for where to look for help if the topic is observed.
isPartOf: pending.schema.org
source: https://github.com/schemaorg/schemaorg/issues/2374

qualifications
type: Property
comment: Specific qualifications required for this role or Occupation.
domainIncludes: Occupation
domainIncludes: JobPosting
isPartOf: pending.schema.org
rangeIncludes: Credential
rangeIncludes: Text
source: https://github.com/schemaorg/schemaorg/issues/1698
source: https://github.com/schemaorg/schemaorg/issues/1779

PronounceableText
type: Class
comment: Data type: PronounceableText.
subclass of: Text
isPartOf: pending.schema.org
source: https://github.com/schemaorg/schemaorg/issues/2108

creditedTo
type: Property
comment: The group the release is credited to if different than the byArtist. For example, Red and Blue is credited to "Stefani Germanotta Band", but by Lady Gaga.
contributor: MBZ
domainIncludes: MusicRelease
rangeIncludes: Organization
rangeIncludes: Person

molecularFormula
type: Property
comment: The empirical formula is the simplest whole number ratio of all the atoms in a molecule.
domainIncludes: MolecularEntity
isPartOf: pending.schema.org
rangeIncludes: Text
source: MolecularEntity

events
type: Property
comment: Upcoming or past events associated with this place or organization.
domainIncludes: Place
domainIncludes: Organization
rangeIncludes: Event
supersededBy: event

containsPlace
type: Property
comment: The basic containment relation between a place and another that it contains.
domainIncludes: Place
inverseOf: containedInPlace
rangeIncludes: Place

EUEnergyEfficiencyCategoryD
type: EUEnergyEfficiencyEnumeration
comment: Represents EU Energy Efficiency Class D as defined in EU energy labeling regulations.
isPartOf: pending.schema.org
source: https://github.com/schemaorg/schemaorg/issues/2670

BodyMeasurementInsideLeg
type: BodyMeasurementTypeEnumeration
comment: Inside leg (measured between crotch and soles of feet). Used, for example, to fit pants.
isPartOf: pending.schema.org
source: https://github.com/schemaorg/schemaorg/issues/2811

AutoRepair
type: Class
comment: Car repair business.
subclass of: AutomotiveBusiness

IncentiveStatusActive
type: IncentiveStatus
comment: This incentive is currently active.
isPartOf: pending.schema.org
source: https://github.com/schemaorg/schemaorg/issues/3572

seatNumber
type: Property
comment: The location of the reserved seat (e.g., 27).
domainIncludes: Seat
rangeIncludes: Text

sdPublisher
type: Property
comment: Indicates the party responsible for generating and publishing the current structured data markup, typically in cases where the structured data is derived automatically from existing published content but published on a different site. For example, student projects and open data initiatives often re-publish existing content with more explicitly structured metadata. The sdPublisher property helps make such practices more explicit.
domainIncludes: CreativeWork
isPartOf: pending.schema.org
rangeIncludes: Organization
rangeIncludes: Person
source: https://github.com/schemaorg/schemaorg/issues/1886

PlaceOfWorship
type: Class
comment: Place of worship, such as a church, synagogue, or mosque.
subclass of: CivicStructure

FulfillmentTypeScheduledDelivery
type: FulfillmentTypeEnumeration
comment: Fulfillment to a customer selected address after scheduling with the customer.
isPartOf: pending.schema.org
source: https://github.com/schemaorg/schemaorg/issues/3617

SizeSystemEnumeration
type: Class
comment: Enumerates common size systems for different categories of products, for example "EN-13402" or "UK" for wearables or "Imperial" for screws.
subclass of: Enumeration
isPartOf: pending.schema.org
source: https://github.com/schemaorg/schemaorg/issues/2811

AuthenticateAction
type: Class
comment: The action of authenticating into a device or application.
subclass of: ControlAction
isPartOf: pending.schema.org
source: https://github.com/schemaorg/schemaorg/issues/4507

cvdNumBedsOcc
type: Property
comment: numbedsocc - HOSPITAL INPATIENT BED OCCUPANCY: Total number of staffed inpatient beds that are occupied.
domainIncludes: CDCPMDRecord
isPartOf: pending.schema.org
rangeIncludes: Number
source: https://github.com/schemaorg/schemaorg/issues/2521

worstRating
type: Property
comment: The lowest value allowed in this rating system.
domainIncludes: Rating
rangeIncludes: Text
rangeIncludes: Number

suggestedMaxAge
type: Property
comment: Maximum recommended age in years for the audience or user.
domainIncludes: PeopleAudience
rangeIncludes: Number

legislationTransposes
type: Property
equivalent property: transposes
comment: Indicates that this legislation (or part of legislation) fulfills the objectives set by another legislation, by passing appropriate implementation measures. Typically, some legislations of European Union's member states or regions transpose European Directives. This indicates a legally binding link between the 2 legislations.
sub property of: legislationApplies
contributor: ELI
domainIncludes: Legislation
isPartOf: pending.schema.org
rangeIncludes: Legislation
source: https://github.com/schemaorg/schemaorg/issues/1156
source: eli

ShippingConditions
type: Class
comment: ShippingConditions represent a set of constraints and information about the conditions of shipping a product. Such conditions may apply to only a subset of the products being shipped, depending on aspects of the product like weight, size, price, destination, and others. All the specified conditions must be met for this ShippingConditions to apply.
subclass of: StructuredValue
isPartOf: pending.schema.org
source: https://github.com/schemaorg/schemaorg/issues/3617

torque
type: Property
comment: The torque (turning force) of the vehicle's engine.\n\nTypical unit code(s): NU for newton metre (N m), F17 for pound-force per foot, or F48 for pound-force per inch\n\n* Note 1: You can link to information about how the given value has been determined (e.g. reference RPM) using the valueReference property.\n* Note 2: You can use minValue and maxValue to indicate ranges.
contributor: Automotive Ontology Working Group
domainIncludes: EngineSpecification
isPartOf: auto.schema.org
rangeIncludes: QuantitativeValue

EducationalOccupationalCredential
type: Class
comment: An educational or occupational credential. A diploma, academic degree, certification, qualification, badge, etc., that may be awarded to a person or other entity that meets the requirements defined by the credentialer.
subclass of: Credential
isPartOf: pending.schema.org
source: https://github.com/schemaorg/schemaorg/issues/1779

datePosted
type: Property
comment: Publication date of an online listing.
domainIncludes: RealEstateListing
domainIncludes: CDCPMDRecord
domainIncludes: SpecialAnnouncement
domainIncludes: JobPosting
rangeIncludes: DateTime
rangeIncludes: Date
source: https://github.com/schemaorg/schemaorg/issues/2521
source: https://github.com/schemaorg/schemaorg/issues/2490

orderStatus
type: Property
comment: The current status of the order.
domainIncludes: Order
rangeIncludes: OrderStatus

text
type: Property
comment: The textual content of this CreativeWork.
domainIncludes: CreativeWork
rangeIncludes: Text

actionAccessibilityRequirement
type: Property
comment: A set of requirements that must be fulfilled in order to perform an Action. If more than one value is specified, fulfilling one set of requirements will allow the Action to be performed.
domainIncludes: ConsumeAction
rangeIncludes: ActionAccessSpecification
source: https://github.com/schemaorg/schemaorg/issues/1741

hospitalAffiliation
type: Property
comment: A hospital with which the physician or office is affiliated.
domainIncludes: Physician
isPartOf: health-lifesci.schema.org
rangeIncludes: Hospital

Certification
type: Class
equivalent class: SpecifiedCertificate
equivalent class: CertificationDetails
comment: A Certification is an official and authoritative statement about a subject, for example a product, service, person, or organization. A certification is typically issued by an indendent certification body, for example a professional organization or government. It formally attests certain characteristics about the subject, for example Organizations can be ISO certified, Food products can be certified Organic or Vegan, a Person can be a certified professional, a Place can be certified for food processing. There are certifications for many domains: regulatory, organizational, recycling, food, efficiency, educational, ecological, etc. A certification is a form of credential, as are accreditations and licenses. Mapped from the [gs1:CertificationDetails](https://www.gs1.org/voc/CertificationDetails) class in the GS1 Web Vocabulary.
subclass of: Certificate
subclass of: CreativeWork
isPartOf: pending.schema.org
source: https://github.com/schemaorg/schemaorg/issues/3230

totalHistoricalEnrollment
type: Property
comment: The total number of students that have enrolled in the history of the course.
domainIncludes: Course
isPartOf: pending.schema.org
rangeIncludes: Integer
source: https://github.com/schemaorg/schemaorg/issues/3281

dissolutionDate
type: Property
equivalent property: organizationTerminationDate
comment: The date that this organization was dissolved.
domainIncludes: Organization
rangeIncludes: Date

IncentiveStatusOnHold
type: IncentiveStatus
comment: This incentive is currently active, but may not be accepting new applicants (e.g. max number of redemptions reached for a year)
isPartOf: pending.schema.org
source: https://github.com/schemaorg/schemaorg/issues/3572

KeepProduct
type: ReturnMethodEnumeration
comment: Specifies that the consumer can keep the product, even when receiving a refund or store credit.
isPartOf: pending.schema.org
source: https://github.com/schemaorg/schemaorg/issues/2880

TrainStation
type: Class
comment: A train station.
subclass of: CivicStructure

webFeed
type: Property
comment: The URL for a feed, e.g. associated with a podcast series, blog, or series of date-stamped updates. This is usually RSS or Atom.
domainIncludes: PodcastSeries
domainIncludes: SpecialAnnouncement
isPartOf: pending.schema.org
rangeIncludes: URL
rangeIncludes: DataFeed
source: https://github.com/schemaorg/schemaorg/issues/373

Ayurvedic
type: MedicineSystem
comment: A system of medicine that originated in India over thousands of years and that focuses on integrating and balancing the body, mind, and spirit.
isPartOf: health-lifesci.schema.org

accommodationFloorPlan
type: Property
comment: A floorplan of some Accommodation.
domainIncludes: Accommodation
domainIncludes: Residence
isPartOf: pending.schema.org
rangeIncludes: FloorPlan
source: https://github.com/schemaorg/schemaorg/issues/2373

Quantity
type: DataType
type: Class
comment: Quantities such as distance, time, mass, weight, etc. Particular instances of say Mass are strings like '3 kg' or '4 milligrams'.

MenuSection
type: Class
comment: A sub-grouping of food or drink items in a menu. E.g. courses (such as 'Dinner', 'Breakfast', etc.), specific type of dishes (such as 'Meat', 'Vegan', 'Drinks', etc.), or some other classification made by the menu provider.
subclass of: CreativeWork

MSRP
type: PriceTypeEnumeration
comment: Represents the manufacturer suggested retail price ("MSRP") of an offered product.
isPartOf: pending.schema.org
source: https://github.com/schemaorg/schemaorg/issues/2712

valueMaxLength
type: Property
comment: Specifies the allowed range for number of characters in a literal value.
domainIncludes: PropertyValueSpecification
rangeIncludes: Number

educationalProgramMode
type: Property
comment: Similar to courseMode, the medium or means of delivery of the program as a whole. The value may either be a text label (e.g. "online", "onsite" or "blended"; "synchronous" or "asynchronous"; "full-time" or "part-time") or a URL reference to a term from a controlled vocabulary (e.g. https://ceds.ed.gov/element/001311#Asynchronous ).
domainIncludes: EducationalOccupationalProgram
isPartOf: pending.schema.org
rangeIncludes: URL
rangeIncludes: Text
source: https://github.com/schemaorg/schemaorg/issues/2419

ByBankTransferInAdvance
type: PaymentMethodType
comment: Payment in advance by bank transfer, equivalent to http://purl.org/goodrelations/v1#ByBankTransferInAdvance.

InfectiousAgentClass
type: Class
comment: Classes of agents or pathogens that transmit infectious diseases. Enumerated type.
subclass of: MedicalEnumeration
isPartOf: health-lifesci.schema.org

monoisotopicMolecularWeight
type: Property
comment: The monoisotopic mass is the sum of the masses of the atoms in a molecule using the unbound, ground-state, rest mass of the principal (most abundant) isotope for each element instead of the isotopic average mass. Please include the units in the form '<Number> <unit>', for example '770.230488 g/mol' or as '<QuantitativeValue>.
domainIncludes: MolecularEntity
isPartOf: pending.schema.org
rangeIncludes: Text
rangeIncludes: QuantitativeValue
source: MolecularEntity

item
type: Property
comment: An entity represented by an entry in a list or data feed (e.g. an 'artist' in a list of 'artists').
domainIncludes: DataFeedItem
domainIncludes: ListItem
rangeIncludes: Thing

telephone
type: Property
equivalent property: telephone
comment: The telephone number.
domainIncludes: Organization
domainIncludes: Person
domainIncludes: Place
domainIncludes: ContactPoint
rangeIncludes: Text

Geriatric
type: MedicalSpecialty
comment: A specific branch of medical science that is concerned with the diagnosis and treatment of diseases, debilities and provision of care to the aged.
subclass of: MedicalBusiness
isPartOf: health-lifesci.schema.org

Country
type: Class
equivalent class: Country
comment: A country.
subclass of: AdministrativeArea
subclass of: GeopoliticalEntity

cause
type: Property
comment: The cause of a medical condition.
domainIncludes: MedicalCondition
inverseOf: causeOf
isPartOf: health-lifesci.schema.org
rangeIncludes: MedicalCause

cvdNumC19HOPats
type: Property
comment: numc19hopats - HOSPITAL ONSET: Patients hospitalized in an NHSN inpatient care location with onset of suspected or confirmed COVID-19 14 or more days after hospitalization.
domainIncludes: CDCPMDRecord
isPartOf: pending.schema.org
rangeIncludes: Number
source: https://github.com/schemaorg/schemaorg/issues/2521

SportsActivityLocation
type: Class
comment: A sports location, such as a playing field.
subclass of: LocalBusiness

FreeReturn
type: ReturnFeesEnumeration
comment: Specifies that product returns are free of charge for the customer.
isPartOf: pending.schema.org
source: https://github.com/schemaorg/schemaorg/issues/2880

BoatReservation
type: Class
comment: A reservation for boat travel. Note: This type is for information about actual reservations, e.g. in confirmation emails or HTML pages with individual confirmations of reservations. For offers of tickets, use Offer.
subclass of: Reservation
isPartOf: pending.schema.org
source: https://github.com/schemaorg/schemaorg/issues/1755

StagedContent
type: MediaManipulationRatingEnumeration
comment: Content coded 'staged content' in a MediaReview, considered in the context of how it was published or shared. For a VideoObject to be 'staged content': A video that has been created using actors or similarly contrived. For an ImageObject to be 'staged content': An image that was created using actors or similarly contrived, such as a screenshot of a fake tweet. For an ImageObject with embedded text to be 'staged content': An image that was created using actors or similarly contrived, such as a screenshot of a fake tweet. For an AudioObject to be 'staged content': Audio that has been created using actors or similarly contrived.
isPartOf: pending.schema.org
source: https://github.com/schemaorg/schemaorg/issues/2450

hasDefinedTerm
type: Property
comment: A Defined Term contained in this term set.
domainIncludes: DefinedTermSet
domainIncludes: Taxon
isPartOf: pending.schema.org
rangeIncludes: DefinedTerm
source: https://github.com/schemaorg/schemaorg/issues/894

NarcoticConsideration
type: AdultOrientedEnumeration
comment: Item is a narcotic as defined by the [1961 UN convention](https://www.incb.org/incb/en/narcotic-drugs/Yellowlist/yellow-list.html), for example marijuana or heroin.
isPartOf: pending.schema.org
source: https://github.com/schemaorg/schemaorg/issues/2989

PhysicalActivity
type: Class
comment: Any bodily activity that enhances or maintains physical fitness and overall health and wellness. Includes activity that is part of daily living and routine, structured exercise, and exercise prescribed as part of a medical treatment or recovery plan.
subclass of: LifestyleModification
isPartOf: health-lifesci.schema.org

CityHall
type: Class
comment: A city hall.
subclass of: GovernmentBuilding

medicineSystem
type: Property
comment: The system of medicine that includes this MedicalEntity, for example 'evidence-based', 'homeopathic', 'chiropractic', etc.
domainIncludes: MedicalEntity
isPartOf: health-lifesci.schema.org
rangeIncludes: MedicineSystem

language
type: Property
comment: A sub property of instrument. The language used on this action.
sub property of: instrument
domainIncludes: WriteAction
domainIncludes: CommunicateAction
rangeIncludes: Language
supersededBy: inLanguage

jobDuration
type: Property
comment: The expected duration of an employment offer as advertised by the employer. Relevant for job postings that have a clearly defined period in mind such as seasonal work, substitutes for maternal leave or any other temporary employment.
domainIncludes: JobPosting
isPartOf: pending.schema.org
rangeIncludes: QuantitativeValue
rangeIncludes: Duration
source: https://github.com/schemaorg/schemaorg/issues/4475

usesHealthPlanIdStandard
type: Property
comment: The standard for interpreting the Plan ID. The preferred is "HIOS". See the Centers for Medicare & Medicaid Services for more details.
domainIncludes: HealthInsurancePlan
isPartOf: pending.schema.org
rangeIncludes: Text
rangeIncludes: URL
source: https://github.com/schemaorg/schemaorg/issues/1062

option
type: Property
comment: A sub property of object. The options subject to this action.
sub property of: object
domainIncludes: ChooseAction
rangeIncludes: Text
rangeIncludes: Thing
supersededBy: actionOption

FMRadioChannel
type: Class
comment: A radio channel that uses FM.
subclass of: RadioChannel
source: https://github.com/schemaorg/schemaorg/issues/1004

Brand
type: Class
equivalent class: BrandName
comment: A brand is a name used by an organization or business person for labeling a product, product group, or similar.
subclass of: Intangible
subclass of: Classifier
contributor: good-relations-and-schema-org

passengerPriorityStatus
type: Property
comment: The priority status assigned to a passenger for security or boarding (e.g. FastTrack or Priority).
domainIncludes: FlightReservation
rangeIncludes: Text
rangeIncludes: QualitativeValue

subTrip
type: Property
comment: Identifies a Trip that is a subTrip of this Trip. For example Day 1, Day 2, etc. of a multi-day trip.
contributor: Tourism
domainIncludes: Trip
inverseOf: partOfTrip
isPartOf: pending.schema.org
rangeIncludes: Trip
source: https://github.com/schemaorg/schemaorg/issues/1810

MerchantReturnNotPermitted
type: MerchantReturnEnumeration
comment: Specifies that product returns are not permitted.
isPartOf: pending.schema.org
source: https://github.com/schemaorg/schemaorg/issues/2288

OfferForPurchase
type: Class
comment: An OfferForPurchase in Schema.org represents an Offer to sell something, i.e. an Offer whose businessFunction is [sell](http://purl.org/goodrelations/v1#Sell.). See [Good Relations](https://en.wikipedia.org/wiki/GoodRelations) for background on the underlying concepts.
subclass of: Offer
isPartOf: pending.schema.org
source: https://github.com/schemaorg/schemaorg/issues/2348

offeredBy
type: Property
equivalent property: isOfferedBy
comment: A pointer to the organization or person making the offer.
domainIncludes: Offer
inverseOf: makesOffer
rangeIncludes: Organization
rangeIncludes: Person

alternativeHeadline
type: Property
comment: A secondary title of the CreativeWork.
domainIncludes: CreativeWork
rangeIncludes: Text

Surgical
type: MedicalSpecialty
comment: A specific branch of medical science that pertains to treating diseases, injuries and deformities by manual and instrumental means.
isPartOf: health-lifesci.schema.org

applicantLocationRequirements
type: Property
comment: The location(s) applicants can apply from. This is usually used for telecommuting jobs where the applicant does not need to be in a physical office. Note: This should not be used for citizenship or work visa requirements.
domainIncludes: JobPosting
isPartOf: pending.schema.org
rangeIncludes: AdministrativeArea
source: https://github.com/schemaorg/schemaorg/issues/2083

Library
type: Class
comment: A library.
subclass of: LocalBusiness

MixedEventAttendanceMode
type: EventAttendanceModeEnumeration
comment: MixedEventAttendanceMode - an event that is conducted as a combination of both offline and online modes.
isPartOf: pending.schema.org
source: https://github.com/schemaorg/schemaorg/issues/1842

OnlineEventAttendanceMode
type: EventAttendanceModeEnumeration
comment: OnlineEventAttendanceMode - an event that is primarily conducted online.
isPartOf: pending.schema.org
source: https://github.com/schemaorg/schemaorg/issues/1842

ExercisePlan
type: Class
comment: Fitness-related activity designed for a specific health-related purpose, including defined exercise routines as well as activity prescribed by a clinician.
subclass of: PhysicalActivity
subclass of: CreativeWork
isPartOf: health-lifesci.schema.org

restPeriods
type: Property
comment: How often one should break from the activity.
domainIncludes: ExercisePlan
isPartOf: health-lifesci.schema.org
rangeIncludes: QuantitativeValue
rangeIncludes: Text

PlasticSurgery
type: MedicalSpecialty
comment: A specific branch of medical science that pertains to therapeutic or cosmetic repair or re-formation of missing, injured or malformed tissues or body parts by manual and instrumental means.
subclass of: MedicalBusiness
isPartOf: health-lifesci.schema.org

actionApplication
type: Property
comment: An application that can complete the request.
domainIncludes: EntryPoint
rangeIncludes: SoftwareApplication

Grant
type: Class
comment: A grant, typically financial or otherwise quantifiable, of resources. Typically a funder sponsors some MonetaryAmount to an Organization or Person, sometimes not necessarily via a dedicated or long-lived Project, resulting in one or more outputs, or fundedItems. For financial sponsorship, indicate the funder of a MonetaryGrant. For non-financial support, indicate sponsor of Grants of resources (e.g. office space). Grants support activities directed towards some agreed collective goals, often but not always organized as Projects. Long-lived projects are sometimes sponsored by a variety of grants over time, but it is also common for a project to be associated with a single grant. The amount of a Grant is represented using amount as a MonetaryAmount.
subclass of: Intangible
isPartOf: pending.schema.org
source: https://github.com/schemaorg/schemaorg/issues/383
source: FundInfoCollab

Registry
type: MedicalObservationalStudyDesign
comment: A registry-based study design.
isPartOf: health-lifesci.schema.org

discountCurrency
type: Property
comment: The currency of the discount.\n\nUse standard formats: [ISO 4217 currency format](http://en.wikipedia.org/wiki/ISO_4217), e.g. "USD"; [Ticker symbol](https://en.wikipedia.org/wiki/List_of_cryptocurrencies) for cryptocurrencies, e.g. "BTC"; well known names for [Local Exchange Trading Systems](https://en.wikipedia.org/wiki/Local_exchange_trading_system) (LETS) and other currency types, e.g. "Ithaca HOUR".
domainIncludes: Order
rangeIncludes: Text

Atlas
type: Class
comment: A collection or bound volume of maps, charts, plates or tables, physical or in media form illustrating any subject.
subclass of: CreativeWork
isPartOf: bib.schema.org
source: Atlas

includedRiskFactor
type: Property
comment: A modifiable or non-modifiable risk factor included in the calculation, e.g. age, coexisting condition.
domainIncludes: MedicalRiskEstimator
isPartOf: health-lifesci.schema.org
rangeIncludes: MedicalRiskFactor

WebApplication
type: Class
comment: Web applications.
subclass of: SoftwareApplication

BackOrder
type: ItemAvailability
comment: Indicates that the item is available on back order.

addressRegion
type: Property
equivalent property: hasCountrySubdivision
comment: The region in which the locality is, and which is in the country. For example, California or another appropriate first-level [Administrative division](https://en.wikipedia.org/wiki/List_of_administrative_divisions_by_country) such as the Province in Italy or Region in Germany.
domainIncludes: PostalAddress
domainIncludes: DefinedRegion
rangeIncludes: Text
rangeIncludes: AdministrativeArea
source: https://github.com/schemaorg/schemaorg/issues/2506

Saturday
type: DayOfWeek
comment: The day of the week between Friday and Sunday.

ItemAvailability
type: Class
comment: A list of possible product availability options.
subclass of: Enumeration

DecontextualizedContent
type: MediaManipulationRatingEnumeration
comment: Content coded 'missing context' in a MediaReview, considered in the context of how it was published or shared. For a VideoObject to be 'missing context': Presenting unaltered video in an inaccurate manner that misrepresents the footage. For example, using incorrect dates or locations, altering the transcript or sharing brief clips from a longer video to mislead viewers. (A video rated 'original' can also be missing context.) For an ImageObject to be 'missing context': Presenting unaltered images in an inaccurate manner to misrepresent the image and mislead the viewer. For example, a common tactic is using an unaltered image but saying it came from a different time or place. (An image rated 'original' can also be missing context.) For an ImageObject with embedded text to be 'missing context': An unaltered image presented in an inaccurate manner to misrepresent the image and mislead the viewer. For example, a common tactic is using an unaltered image but saying it came from a different time or place. (An 'original' image with inaccurate text would generally fall in this category.) For an AudioObject to be 'missing context': Unaltered audio presented in an inaccurate manner that misrepresents it. For example, using incorrect dates or locations, or sharing brief clips from a longer recording to mislead viewers. (Audio rated “original” can also be missing context.)
isPartOf: pending.schema.org
source: https://github.com/schemaorg/schemaorg/issues/2450

legislationCountersignedBy
type: Property
equivalent property: countersigned by
comment: The person or organization that countersigned the legislation. Depending on the legal context, a countersignature can indicate that the signed authority undertakes to assume responsibility for texts emanating from a person who is inviolable and irresponsible, (for example a King, Grand Duc or President), or that the authority is in charge of the implementation of the text.
contributor: ELI
domainIncludes: Legislation
isPartOf: pending.schema.org
rangeIncludes: Organization
rangeIncludes: Person
source: https://github.com/schemaorg/schemaorg/issues/2698
source: eli

Audience
type: Class
comment: Intended audience for an item, i.e. the group for whom the item was created.
subclass of: Intangible

Mosque
type: Class
comment: A mosque.
subclass of: PlaceOfWorship

ExchangeRefund
type: RefundTypeEnumeration
comment: Specifies that a refund can be done as an exchange for the same product.
isPartOf: pending.schema.org
source: https://github.com/schemaorg/schemaorg/issues/2288

foundingDate
type: Property
equivalent property: organizationFormationDate
comment: The date that this organization was founded.
domainIncludes: Organization
rangeIncludes: Date

seatSection
type: Property
comment: The section location of the reserved seat (e.g. Orchestra).
domainIncludes: Seat
rangeIncludes: Text

winner
type: Property
comment: A sub property of participant. The winner of the action.
sub property of: participant
domainIncludes: LoseAction
rangeIncludes: Person

Language
type: Class
comment: Natural languages such as Spanish, Tamil, Hindi, English, etc. Formal language code tags expressed in [BCP 47](https://en.wikipedia.org/wiki/IETF_language_tag) can be used via the alternateName property. The Language type previously also covered programming languages such as Scheme and Lisp, which are now best represented using ComputerLanguage.
subclass of: Intangible

regionsAllowed
type: Property
comment: The regions where the media is allowed. If not specified, then it's assumed to be allowed everywhere. Specify the countries in [ISO 3166 format](http://en.wikipedia.org/wiki/ISO_3166).
domainIncludes: MediaObject
rangeIncludes: Place

isConsumableFor
type: Property
comment: A pointer to another product (or multiple products) for which this product is a consumable.
contributor: GoodRelationsTerms
domainIncludes: Product
rangeIncludes: Product

mainContentOfPage
type: Property
comment: Indicates if this web page element is the main subject of the page.
domainIncludes: WebPage
rangeIncludes: WebPageElement

paymentMethod
type: Property
comment: The name of the credit card or other method of payment for the order.
sub property of: hasPaymentMechanism
domainIncludes: Invoice
domainIncludes: Order
rangeIncludes: Text
rangeIncludes: PaymentMethod
source: https://github.com/schemaorg/schemaorg/issues/3537

preOp
type: Property
comment: A description of the workup, testing, and other preparations required before implanting this device.
domainIncludes: MedicalDevice
isPartOf: health-lifesci.schema.org
rangeIncludes: Text

acceptedAnswer
type: Property
comment: The answer(s) that has been accepted as best, typically on a Question/Answer site. Sites vary in their selection mechanisms, e.g. drawing on community opinion and/or the view of the Question author.
sub property of: suggestedAnswer
domainIncludes: Question
rangeIncludes: ItemList
rangeIncludes: Answer

servesCuisine
type: Property
comment: The cuisine of the restaurant.
domainIncludes: FoodEstablishment
rangeIncludes: Text

abridged
type: Property
comment: Indicates whether the book is an abridged edition.
domainIncludes: Book
isPartOf: bib.schema.org
rangeIncludes: Boolean

PodcastSeries
type: Class
comment: A podcast is an episodic series of digital audio or video files which a user can download and listen to.
subclass of: CreativeWorkSeries
isPartOf: pending.schema.org
source: https://github.com/schemaorg/schemaorg/issues/373

yearsInOperation
type: Property
comment: The age of the business.
domainIncludes: BusinessAudience
rangeIncludes: QuantitativeValue

passengerSequenceNumber
type: Property
comment: The passenger's sequence number as assigned by the airline.
domainIncludes: FlightReservation
rangeIncludes: Text

sponsor
type: Property
comment: A person or organization that supports a thing through a pledge, promise, or financial contribution. E.g. a sponsor of a Medical Study or a corporate sponsor of an event.
domainIncludes: MedicalStudy
domainIncludes: Event
domainIncludes: Organization
domainIncludes: Person
domainIncludes: CreativeWork
domainIncludes: Grant
rangeIncludes: Organization
rangeIncludes: Person

ActiveActionStatus
type: ActionStatusType
comment: An in-progress action (e.g., while watching the movie, or driving to a location).

lesser
type: Property
comment: This ordering relation for qualitative values indicates that the subject is lesser than the object.
contributor: GoodRelationsTerms
domainIncludes: QualitativeValue
rangeIncludes: QualitativeValue

PerformanceRole
type: Class
comment: A PerformanceRole is a Role that some entity places with regard to a theatrical performance, e.g. in a Movie, TVSeries etc.
subclass of: Role

HowToStep
type: Class
comment: A step in the instructions for how to achieve a result. It is an ordered list with HowToDirection and/or HowToTip items.
subclass of: ListItem
subclass of: CreativeWork
subclass of: ItemList

GroupBoardingPolicy
type: BoardingPolicyType
comment: The airline boards by groups based on check-in time, priority, etc.

inker
type: Property
comment: The individual who traces over the pencil drawings in ink after pencils are complete.
domainIncludes: VisualArtwork
domainIncludes: ComicStory
domainIncludes: ComicIssue
isPartOf: bib.schema.org
rangeIncludes: Person

minPrice
type: Property
comment: The lowest price if the price is a range.
sub property of: hasMonetaryAmount
sub property of: hasLowerBound
contributor: GoodRelationsTerms
domainIncludes: PriceSpecification
rangeIncludes: Number

ReturnFeesCustomerResponsibility
type: ReturnFeesEnumeration
comment: Specifies that product returns must be paid for, and are the responsibility of, the customer.
isPartOf: pending.schema.org
source: https://github.com/schemaorg/schemaorg/issues/2880

requiredCollateral
type: Property
comment: Assets required to secure loan or credit repayments. It may take form of third party pledge, goods, financial instruments (cash, securities, etc.)
contributor: FIBO
domainIncludes: LoanOrCredit
rangeIncludes: Thing
rangeIncludes: Text

WearableSizeGroupWomens
type: WearableSizeGroupEnumeration
comment: Size group "Womens" for wearables.
isPartOf: pending.schema.org
source: https://github.com/schemaorg/schemaorg/issues/2811

PositiveFilmDigitalSource
type: IPTCDigitalSourceEnumeration
comment: Content coded as 'positive film' using the IPTC digital source type vocabulary.
isPartOf: pending.schema.org
source: https://github.com/schemaorg/schemaorg/issues/3392

VoteAction
type: Class
comment: The act of expressing a preference from a fixed/finite/structured set of choices/options.
subclass of: ChooseAction

contributor
type: Property
equivalent property: contributor
comment: A secondary contributor to the CreativeWork or Event.
domainIncludes: Event
domainIncludes: CreativeWork
rangeIncludes: Organization
rangeIncludes: Person

penciler
type: Property
comment: The individual who draws the primary narrative artwork.
domainIncludes: VisualArtwork
domainIncludes: ComicStory
domainIncludes: ComicIssue
isPartOf: bib.schema.org
rangeIncludes: Person

insertion
type: Property
comment: The place of attachment of a muscle, or what the muscle moves.
domainIncludes: Muscle
isPartOf: health-lifesci.schema.org
rangeIncludes: AnatomicalStructure

activityFrequency
type: Property
comment: How often one should engage in the activity.
domainIncludes: ExercisePlan
isPartOf: health-lifesci.schema.org
rangeIncludes: QuantitativeValue
rangeIncludes: Text

Legislation
type: Class
comment: A legal document such as an act, decree, bill, etc. (enforceable or not) or a component of a legal act (like an article).
subclass of: CreativeWork
contributor: ELI
isPartOf: pending.schema.org
source: https://github.com/schemaorg/schemaorg/issues/1156
source: eli

FinancialIncentive
type: Class
comment: Represents financial incentives for goods/services offered by an organization (or individual). Typically contains the name of the incentive, the incentivizedItem, the incentiveAmount, the incentiveStatus, incentiveType, the provider of the incentive, and eligibleWithSupplier. Optionally contains criteria on whether the incentive is limited based on purchaseType, purchasePriceLimit, incomeLimit, and the qualifiedExpense.
subclass of: Intangible
isPartOf: pending.schema.org
source: https://github.com/schemaorg/schemaorg/issues/3572

LaboratoryScience
type: MedicalSpecialty
comment: A medical science pertaining to chemical, hematological, immunologic, microscopic, or bacteriological diagnostic analyses or research.
isPartOf: health-lifesci.schema.org

SideEffectsHealthAspect
type: HealthAspectEnumeration
comment: Side effects that can be observed from the usage of the topic.
isPartOf: pending.schema.org
source: https://github.com/schemaorg/schemaorg/issues/2374

BodyMeasurementTypeEnumeration
type: Class
comment: Enumerates types (or dimensions) of a person's body measurements, for example for fitting of clothes.
subclass of: MeasurementTypeEnumeration
isPartOf: pending.schema.org
source: https://github.com/schemaorg/schemaorg/issues/2811

publicationType
type: Property
comment: The type of the medical article, taken from the US NLM MeSH publication type catalog. See also [MeSH documentation](http://www.nlm.nih.gov/mesh/pubtypes.html).
domainIncludes: MedicalScholarlyArticle
isPartOf: health-lifesci.schema.org
rangeIncludes: Text

PatientExperienceHealthAspect
type: HealthAspectEnumeration
comment: Content about the real life experience of patients or people that have lived a similar experience about the topic. May be forums, topics, Q-and-A and related material.
isPartOf: pending.schema.org
source: https://github.com/schemaorg/schemaorg/issues/2374

Nonprofit501c1
type: USNonprofitType
comment: Nonprofit501c1: Non-profit type referring to Corporations Organized Under Act of Congress, including Federal Credit Unions and National Farm Loan Associations.
isPartOf: pending.schema.org
source: https://github.com/schemaorg/schemaorg/issues/2543

reviewBody
type: Property
comment: The actual body of the review.
domainIncludes: Review
rangeIncludes: Text

archiveHeld
type: Property
comment: Collection, [fonds](https://en.wikipedia.org/wiki/Fonds), or item held, kept or maintained by an ArchiveOrganization.
domainIncludes: ArchiveOrganization
inverseOf: holdingArchive
isPartOf: pending.schema.org
rangeIncludes: ArchiveComponent
source: https://github.com/schemaorg/schemaorg/issues/1758

isProprietary
type: Property
comment: True if this item's name is a proprietary/brand name (vs. generic name).
domainIncludes: DietarySupplement
domainIncludes: Drug
isPartOf: health-lifesci.schema.org
rangeIncludes: Boolean

DERegisteredAssociationCharity
type: DENonprofitType
comment: DERegisteredAssociationCharity: Non-profit type referring to a charitable association that is registered with the German association register (german gemeinnütziger e.v. or gemeinnütziger eingetragener Verein) and has been recognized by the tax authorities as a charitable non-profit.
isPartOf: pending.schema.org
source: https://github.com/schemaorg/schemaorg/issues/3629

incentiveCompensation
type: Property
comment: Description of bonus and commission compensation aspects of the job.
domainIncludes: JobPosting
rangeIncludes: Text

Synagogue
type: Class
comment: A synagogue.
subclass of: PlaceOfWorship

Ultrasound
type: MedicalImagingTechnique
comment: Ultrasound imaging.
isPartOf: health-lifesci.schema.org

softwareVersion
type: Property
comment: Version of the software instance.
domainIncludes: SoftwareApplication
rangeIncludes: Text

SequentialArt
type: Class
comment: An art forms that use images deployed in a specific order for the purpose of graphic storytelling (i.e., narration of graphic stories) or conveying information. Examples of SequentialArt are Franco-Belgian Bande Dessinée, Comics in the USA and 漫画 (Manga) in Japan.
subclass of: Book
subclass of: VisualArtwork
isPartOf: bib.schema.org

geoIntersects
type: Property
comment: Represents spatial relations in which two geometries (or the places they represent) have at least one point in common. As defined in [DE-9IM](https://en.wikipedia.org/wiki/DE-9IM).
domainIncludes: Place
domainIncludes: GeospatialGeometry
rangeIncludes: Place
rangeIncludes: GeospatialGeometry

articleSection
type: Property
comment: Articles may belong to one or more 'sections' in a magazine or newspaper, such as Sports, Lifestyle, etc.
domainIncludes: Article
rangeIncludes: Text

billingPeriod
type: Property
equivalent property: billingPeriod
comment: The time interval used to compute the invoice.
domainIncludes: Invoice
rangeIncludes: Duration

hoursAvailable
type: Property
comment: The hours during which this service or contact is available.
domainIncludes: Service
domainIncludes: ContactPoint
domainIncludes: LocationFeatureSpecification
rangeIncludes: OpeningHoursSpecification

audio
type: Property
comment: An embedded audio object.
domainIncludes: CreativeWork
rangeIncludes: Clip
rangeIncludes: MusicRecording
rangeIncludes: AudioObject
source: https://github.com/schemaorg/schemaorg/issues/2420

CDCPMDRecord
type: Class
comment: A CDCPMDRecord is a data structure representing a record in a CDC tabular data format used for hospital data reporting. See [documentation](/docs/cdc-covid.html) for details, and the linked CDC materials for authoritative definitions used as the source here.
subclass of: StructuredValue
isPartOf: pending.schema.org
source: https://github.com/schemaorg/schemaorg/issues/2521

duns
type: Property
equivalent property: dUNSId
comment: The Dun & Bradstreet DUNS number for identifying an organization or business person.
sub property of: identifier
contributor: GoodRelationsTerms
domainIncludes: Organization
domainIncludes: Person
rangeIncludes: Text

UserBlocks
type: Class
comment: UserInteraction and its subtypes is an old way of talking about users interacting with pages. It is generally better to use Action-based vocabulary, alongside types such as Comment.
subclass of: UserInteraction
supersededBy: InteractionCounter

trackingUrl
type: Property
comment: Tracking url for the parcel delivery.
domainIncludes: ParcelDelivery
rangeIncludes: URL

Head
type: PhysicalExam
comment: Head assessment with clinical examination.
isPartOf: health-lifesci.schema.org

potentialAction
type: Property
comment: Indicates a potential Action, which describes an idealized action in which this thing would play an 'object' role.
domainIncludes: Thing
rangeIncludes: Action

UserReview
type: Class
comment: A review created by an end-user (e.g. consumer, purchaser, attendee etc.), in contrast with CriticReview.
subclass of: Review
isPartOf: pending.schema.org
source: https://github.com/schemaorg/schemaorg/issues/1589

numberedPosition
type: Property
comment: A number associated with a role in an organization, for example, the number on an athlete's jersey.
domainIncludes: OrganizationRole
rangeIncludes: Number

followup
type: Property
comment: Typical or recommended followup care after the procedure is performed.
domainIncludes: MedicalProcedure
isPartOf: health-lifesci.schema.org
rangeIncludes: Text

associatedArticle
type: Property
comment: A NewsArticle associated with the Media Object.
domainIncludes: MediaObject
rangeIncludes: NewsArticle

PublicHolidays
type: DayOfWeek
comment: This stands for any day that is a public holiday; it is a placeholder for all official public holidays in some particular location. While not technically a "day of the week", it can be used with OpeningHoursSpecification. In the context of an opening hours specification it can be used to indicate opening hours on public holidays, overriding general opening hours for the day of the week on which a public holiday occurs.
contributor: good-relations-and-schema-org

TVSeason
type: Class
comment: Season dedicated to TV broadcast and associated online delivery.
subclass of: CreativeWork
subclass of: CreativeWorkSeason

CheckoutPage
type: Class
comment: Web page type: Checkout page.
subclass of: WebPage

Photograph
type: Class
comment: A photograph.
subclass of: CreativeWork

FDAcategoryA
type: DrugPregnancyCategory
comment: A designation by the US FDA signifying that adequate and well-controlled studies have failed to demonstrate a risk to the fetus in the first trimester of pregnancy (and there is no evidence of risk in later trimesters).
isPartOf: health-lifesci.schema.org

albumRelease
type: Property
comment: A release of this album.
domainIncludes: MusicAlbum
inverseOf: releaseOf
rangeIncludes: MusicRelease

legislationIdentifier
type: Property
comment: An identifier for the legislation. This can be either a string-based identifier, like the CELEX at EU level or the NOR in France, or a web-based, URL/URI identifier, like an ELI (European Legislation Identifier) or an URN-Lex.
sub property of: identifier
contributor: ELI
domainIncludes: Legislation
isPartOf: pending.schema.org
rangeIncludes: Text
rangeIncludes: URL
source: https://github.com/schemaorg/schemaorg/issues/1156
source: eli

publicAccess
type: Property
comment: A flag to signal that the Place is open to public visitors. If this property is omitted there is no assumed default boolean value.
domainIncludes: Place
rangeIncludes: Boolean

numberOfItems
type: Property
comment: The number of items in an ItemList. Note that some descriptions might not fully describe all items in a list (e.g., multi-page pagination); in such cases, the numberOfItems would be for the entire list.
domainIncludes: ItemList
rangeIncludes: Integer

HighSchool
type: Class
comment: A high school.
subclass of: EducationalOrganization

numberOfPlayers
type: Property
comment: Indicate how many people can play this game (minimum, maximum, or range).
domainIncludes: Game
domainIncludes: VideoGameSeries
rangeIncludes: QuantitativeValue

WantAction
type: Class
comment: The act of expressing a desire about the object. An agent wants an object.
subclass of: ReactAction

PathologyTest
type: Class
comment: A medical test performed by a laboratory that typically involves examination of a tissue sample by a pathologist.
subclass of: MedicalTest
isPartOf: health-lifesci.schema.org

DrivingSchoolVehicleUsage
type: CarUsageType
comment: Indicates the usage of the vehicle for driving school.
contributor: Automotive Ontology Working Group
isPartOf: auto.schema.org

encodesCreativeWork
type: Property
comment: The CreativeWork encoded by this media object.
domainIncludes: MediaObject
inverseOf: encoding
rangeIncludes: CreativeWork

cookingMethod
type: Property
comment: The method of cooking, such as Frying, Steaming, ...
domainIncludes: Recipe
rangeIncludes: Text

targetName
type: Property
comment: The name of a node in an established educational framework.
domainIncludes: AlignmentObject
rangeIncludes: Text

learningResourceType
type: Property
comment: The predominant type or kind characterizing the learning resource. For example, 'presentation', 'handout'.
domainIncludes: CreativeWork
domainIncludes: LearningResource
rangeIncludes: Text
rangeIncludes: DefinedTerm

branch
type: Property
comment: The branches that delineate from the nerve bundle. Not to be confused with branchOf.
domainIncludes: Nerve
isPartOf: health-lifesci.schema.org
rangeIncludes: AnatomicalStructure
supersededBy: arterialBranch

EditedOrCroppedContent
type: MediaManipulationRatingEnumeration
comment: Content coded 'edited or cropped content' in a MediaReview, considered in the context of how it was published or shared. For a VideoObject to be 'edited or cropped content': The video has been edited or rearranged. This category applies to time edits, including editing multiple videos together to alter the story being told or editing out large portions from a video. For an ImageObject to be 'edited or cropped content': Presenting a part of an image from a larger whole to mislead the viewer. For an ImageObject with embedded text to be 'edited or cropped content': Presenting a part of an image from a larger whole to mislead the viewer. For an AudioObject to be 'edited or cropped content': The audio has been edited or rearranged. This category applies to time edits, including editing multiple audio clips together to alter the story being told or editing out large portions from the recording.
isPartOf: pending.schema.org
source: https://github.com/schemaorg/schemaorg/issues/2450

startOffset
type: Property
comment: The start time of the clip expressed as the number of seconds from the beginning of the work.
domainIncludes: Clip
domainIncludes: SeekToAction
isPartOf: pending.schema.org
rangeIncludes: Number
rangeIncludes: HyperTocEntry
source: https://github.com/schemaorg/schemaorg/issues/2021

image
type: Property
equivalent property: image
comment: An image of the item. This can be a URL or a fully described ImageObject.
domainIncludes: Thing
rangeIncludes: URL
rangeIncludes: ImageObject

expectsAcceptanceOf
type: Property
comment: An Offer which must be accepted before the user can perform the Action. For example, the user may need to buy a movie before being able to watch it.
domainIncludes: MediaSubscription
domainIncludes: ActionAccessSpecification
domainIncludes: ConsumeAction
rangeIncludes: Offer
source: https://github.com/schemaorg/schemaorg/issues/1741

ArriveAction
type: Class
comment: The act of arriving at a place. An agent arrives at a destination from a fromLocation, optionally with participants.
subclass of: MoveAction

SportsTeam
type: Class
comment: Organization: Sports team.
subclass of: SportsOrganization

ComicSeries
type: Class
comment: A sequential publication of comic stories under a unifying title, for example "The Amazing Spider-Man" or "Groo the Wanderer".
subclass of: Periodical
isPartOf: bib.schema.org

PostalCodeRangeSpecification
type: Class
comment: Indicates a range of postal codes, usually defined as the set of valid codes between postalCodeBegin and postalCodeEnd, inclusively.
subclass of: StructuredValue
source: https://github.com/schemaorg/schemaorg/issues/2506

knowsAbout
type: Property
comment: Of a Person, and less typically of an Organization, to indicate a topic that is known about - suggesting possible expertise but not implying it. We do not distinguish skill levels here, or relate this to educational content, events, objectives or JobPosting descriptions.
contributor: TP
domainIncludes: Organization
domainIncludes: Person
isPartOf: pending.schema.org
rangeIncludes: Text
rangeIncludes: URL
rangeIncludes: Thing
source: https://github.com/schemaorg/schemaorg/issues/1688

BloodTest
type: Class
comment: A medical test performed on a sample of a patient's blood.
subclass of: MedicalTest
isPartOf: health-lifesci.schema.org

Zoo
type: Class
comment: A zoo.
subclass of: CivicStructure

InsertAction
type: Class
comment: The act of adding at a specific location in an ordered collection.
subclass of: AddAction

SoftwareSourceCode
type: Class
comment: Computer programming source code. Example: Full (compile ready) solutions, code snippet samples, scripts, templates.
subclass of: CreativeWork

availableLanguage
type: Property
equivalent property: availableLanguage
comment: A language someone may use with or at the item, service or place. Please use one of the language codes from the [IETF BCP 47 standard](http://tools.ietf.org/html/bcp47). See also inLanguage.
domainIncludes: ServiceChannel
domainIncludes: Course
domainIncludes: TouristAttraction
domainIncludes: ContactPoint
domainIncludes: LodgingBusiness
rangeIncludes: Text
rangeIncludes: Language

AutoWash
type: Class
comment: A car wash business.
subclass of: AutomotiveBusiness

returnShippingFeesAmount
type: Property
comment: Amount of shipping costs for product returns (for any reason). Applicable when property returnFees equals ReturnShippingFees.
domainIncludes: MerchantReturnPolicySeasonalOverride
domainIncludes: MerchantReturnPolicy
isPartOf: pending.schema.org
rangeIncludes: MonetaryAmount
source: https://github.com/schemaorg/schemaorg/issues/2880

legislationCorrects
type: Property
equivalent property: corrects
comment: Another legislation in which this one introduces textual changes, like correction of spelling mistakes, with no legal impact (for modifications that have legal impact, use legislationAmends).
contributor: ELI
domainIncludes: Legislation
isPartOf: pending.schema.org
rangeIncludes: Legislation
source: https://github.com/schemaorg/schemaorg/issues/2698
source: eli

availableChannel
type: Property
comment: A means of accessing the service (e.g. a phone bank, a web site, a location, etc.).
domainIncludes: Service
rangeIncludes: ServiceChannel

hasRepresentation
type: Property
comment: A common representation such as a protein sequence or chemical structure for this entity. For images use schema.org/image.
domainIncludes: BioChemEntity
isPartOf: pending.schema.org
rangeIncludes: Text
rangeIncludes: URL
rangeIncludes: PropertyValue
source: www.bioschemas.org

ImageObjectSnapshot
type: Class
comment: A specific and exact (byte-for-byte) version of an ImageObject. Two byte-for-byte identical files, for the purposes of this type, considered identical. If they have different embedded metadata (e.g. XMP, EXIF) the files will differ. Different external facts about the files, e.g. creator or dateCreated that aren't represented in their actual content, do not affect this notion of identity.
subclass of: ImageObject
isPartOf: pending.schema.org
source: https://github.com/schemaorg/schemaorg/issues/2450

Hackathon
type: Class
comment: A [hackathon](https://en.wikipedia.org/wiki/Hackathon) event.
subclass of: Event
isPartOf: pending.schema.org
source: https://github.com/schemaorg/schemaorg/issues/2526

departurePlatform
type: Property
comment: The platform from which the train departs.
domainIncludes: TrainTrip
rangeIncludes: Text

CommunicateAction
type: Class
comment: The act of conveying information to another person via a communication medium (instrument) such as speech, email, or telephone conversation.
subclass of: InteractAction

Answer
type: Class
comment: An answer offered to a question; perhaps correct, perhaps opinionated or wrong.
subclass of: Comment
contributor: QAStackExchange

smiles
type: Property
comment: A specification in form of a line notation for describing the structure of chemical species using short ASCII strings. Double bond stereochemistry \ indicators may need to be escaped in the string in formats where the backslash is an escape character.
sub property of: hasRepresentation
domainIncludes: MolecularEntity
isPartOf: pending.schema.org
rangeIncludes: Text
source: MolecularEntity

ownedFrom
type: Property
comment: The date and time of obtaining the product.
contributor: GoodRelationsTerms
domainIncludes: OwnershipInfo
rangeIncludes: DateTime

query
type: Property
comment: A sub property of instrument. The query used on this action.
sub property of: instrument
domainIncludes: SearchAction
rangeIncludes: Text

temporal
type: Property
comment: The "temporal" property can be used in cases where more specific properties (e.g. temporalCoverage, dateCreated, dateModified, datePublished) are not known to be appropriate.
domainIncludes: CreativeWork
rangeIncludes: Text
rangeIncludes: DateTime

valueAddedTaxIncluded
type: Property
comment: Specifies whether the applicable value-added tax (VAT) is included in the price specification or not.
contributor: GoodRelationsTerms
domainIncludes: PriceSpecification
rangeIncludes: Boolean

DigitalPlatformEnumeration
type: Class
comment: Enumerates some common technology platforms, for use with properties such as actionPlatform. It is not supposed to be comprehensive - when a suitable code is not enumerated here, textual or URL values can be used instead. These codes are at a fairly high level and do not deal with versioning and other nuance. Additional codes can be suggested [in github](https://github.com/schemaorg/schemaorg/issues/3057).
subclass of: Enumeration
isPartOf: pending.schema.org
source: https://github.com/schemaorg/schemaorg/issues/3057

includesAttraction
type: Property
comment: Attraction located at destination.
contributor: Tourism
contributor: IIT-CNR.it
domainIncludes: TouristDestination
isPartOf: pending.schema.org
rangeIncludes: TouristAttraction
source: https://github.com/schemaorg/schemaorg/issues/1810

Reserved
type: ItemAvailability
comment: Indicates that the item is reserved and therefore not available.

stepValue
type: Property
comment: The stepValue attribute indicates the granularity that is expected (and required) of the value in a PropertyValueSpecification.
domainIncludes: PropertyValueSpecification
rangeIncludes: Number

orderItemStatus
type: Property
comment: The current status of the order item.
domainIncludes: OrderItem
rangeIncludes: OrderStatus

seatRow
type: Property
comment: The row location of the reserved seat (e.g., B).
domainIncludes: Seat
rangeIncludes: Text

JewelryStore
type: Class
comment: A jewelry store.
subclass of: Store

target
type: Property
comment: Indicates a target EntryPoint, or url, for an Action.
domainIncludes: Action
rangeIncludes: URL
rangeIncludes: EntryPoint

StudioAlbum
type: MusicAlbumProductionType
comment: StudioAlbum.
contributor: MBZ

WearableSizeGroupGirls
type: WearableSizeGroupEnumeration
comment: Size group "Girls" for wearables.
isPartOf: pending.schema.org
source: https://github.com/schemaorg/schemaorg/issues/2811

medicalAudience
type: Property
comment: Medical audience for page.
domainIncludes: MedicalWebPage
isPartOf: health-lifesci.schema.org
rangeIncludes: MedicalAudience
rangeIncludes: MedicalAudienceType

OnDemandEvent
type: Class
comment: A publication event, e.g. catch-up TV or radio podcast, during which a program is available on-demand.
subclass of: PublicationEvent

HinduTemple
type: Class
comment: A Hindu temple.
subclass of: PlaceOfWorship

DataDrivenMediaDigitalSource
type: IPTCDigitalSourceEnumeration
comment: Content coded as 'data driven media' using the IPTC digital source type vocabulary.
isPartOf: pending.schema.org
source: https://github.com/schemaorg/schemaorg/issues/3392

arrivalBoatTerminal
type: Property
comment: The terminal or port from which the boat arrives.
domainIncludes: BoatTrip
isPartOf: pending.schema.org
rangeIncludes: BoatTerminal
source: https://github.com/schemaorg/schemaorg/issues/1755

FulfillmentTypePickupInStore
type: FulfillmentTypeEnumeration
comment: Fulfillment through pick-up in a store.
isPartOf: pending.schema.org
source: https://github.com/schemaorg/schemaorg/issues/3617

MedicalGuideline
type: Class
comment: Any recommendation made by a standard society (e.g. ACC/AHA) or consensus statement that denotes how to diagnose and treat a particular condition. Note: this type should be used to tag the actual guideline recommendation; if the guideline recommendation occurs in a larger scholarly article, use MedicalScholarlyArticle to tag the overall article, not this type. Note also: the organization making the recommendation should be captured in the recognizingAuthority base property of MedicalEntity.
subclass of: MedicalEntity
isPartOf: health-lifesci.schema.org

menuAddOn
type: Property
comment: Additional menu item(s) such as a side dish of salad or side order of fries that can be added to this menu item. Additionally it can be a menu section containing allowed add-on menu items for this menu item.
domainIncludes: MenuItem
rangeIncludes: MenuSection
rangeIncludes: MenuItem
source: https://github.com/schemaorg/schemaorg/issues/1541

hasBroadcastChannel
type: Property
comment: A broadcast channel of a broadcast service.
domainIncludes: BroadcastService
inverseOf: providesBroadcastService
rangeIncludes: BroadcastChannel
source: https://github.com/schemaorg/schemaorg/issues/1004

Corporation
type: Class
equivalent class: Corporation
comment: Organization: A business corporation.
subclass of: Organization
contributor: rNews

dateCreated
type: Property
comment: The date on which the CreativeWork was created or the item was added to a DataFeed.
domainIncludes: CreativeWork
domainIncludes: DataFeedItem
rangeIncludes: DateTime
rangeIncludes: Date

PreSale
type: ItemAvailability
comment: Indicates that the item is available for ordering and delivery before general availability.

contentSize
type: Property
comment: File size in (mega/kilo)bytes.
domainIncludes: MediaObject
rangeIncludes: Text

ITMutualAidCharity
type: ITNonprofitType
comment: ITMutualAidCharity: Non-profit type referring to associations providing financial aid to people need (Ital. Società di mutuo soccorso or SOMS) according to Italian Law 3818 of 1886.
isPartOf: pending.schema.org
source: https://github.com/schemaorg/schemaorg/issues/3629

icaoCode
type: Property
comment: ICAO identifier for an airport.
domainIncludes: Airport
rangeIncludes: Text

uploadDate
type: Property
comment: Date (including time if available) when this media object was uploaded to this site.
domainIncludes: MediaObject
rangeIncludes: DateTime
rangeIncludes: Date

Infectious
type: MedicalSpecialty
comment: Something in medical science that pertains to infectious diseases, i.e. caused by bacterial, viral, fungal or parasitic infections.
isPartOf: health-lifesci.schema.org

Product
type: Class
equivalent class: TradeProduct
equivalent class: Product
comment: Any offered product or service. For example: a pair of shoes; a concert ticket; the rental of a car; a haircut; or an episode of a TV show streamed online.
subclass of: Thing
contributor: GoodRelationsTerms

speed
type: Property
comment: The speed range of the vehicle. If the vehicle is powered by an engine, the upper limit of the speed range (indicated by maxValue) should be the maximum speed achievable under regular conditions.\n\nTypical unit code(s): KMH for km/h, HM for mile per hour (0.447 04 m/s), KNT for knot\n\n*Note 1: Use minValue and maxValue to indicate the range. Typically, the minimal value is zero.\n* Note 2: There are many different ways of measuring the speed range. You can link to information about how the given value has been determined using the valueReference property.
contributor: Automotive Ontology Working Group
domainIncludes: Vehicle
isPartOf: auto.schema.org
rangeIncludes: QuantitativeValue

TierBenefitLoyaltyPrice
type: TierBenefitEnumeration
comment: Benefit of the tier is a members-only price.
isPartOf: pending.schema.org
source: https://github.com/schemaorg/schemaorg/issues/3563

BowlingAlley
type: Class
comment: A bowling alley.
subclass of: SportsActivityLocation

warrantyPromise
type: Property
comment: The warranty promise(s) included in the offer.
domainIncludes: BuyAction
domainIncludes: SellAction
rangeIncludes: WarrantyPromise
supersededBy: warranty

contactPoints
type: Property
comment: A contact point for a person or organization.
domainIncludes: Organization
domainIncludes: Person
rangeIncludes: ContactPoint
supersededBy: contactPoint

Homeopathic
type: MedicineSystem
comment: A system of medicine based on the principle that a disease can be cured by a substance that produces similar symptoms in healthy people.
isPartOf: health-lifesci.schema.org

TheaterEvent
type: Class
comment: Event type: Theater performance.
subclass of: Event

MedicalSign
type: Class
comment: Any physical manifestation of a person's medical condition discoverable by objective diagnostic tests or physical examination.
subclass of: MedicalSignOrSymptom
isPartOf: health-lifesci.schema.org

permittedUsage
type: Property
comment: Indications regarding the permitted usage of the accommodation.
contributor: STI Accommodation Ontology
domainIncludes: Accommodation
rangeIncludes: Text

LiveAlbum
type: MusicAlbumProductionType
comment: LiveAlbum.
contributor: MBZ

Hospital
type: Class
comment: A hospital.
subclass of: CivicStructure
subclass of: EmergencyService
subclass of: MedicalOrganization

phoneticText
type: Property
comment: Representation of a text textValue using the specified speechToTextMarkup. For example the city name of Houston in IPA: /ˈhjuːstən/.
domainIncludes: PronounceableText
isPartOf: pending.schema.org
rangeIncludes: Text
source: https://github.com/schemaorg/schemaorg/issues/2108

InternetCafe
type: Class
comment: An internet cafe.
subclass of: LocalBusiness

memoryRequirements
type: Property
comment: Minimum memory requirements.
domainIncludes: SoftwareApplication
rangeIncludes: Text
rangeIncludes: URL

legislationEnsuresImplementationOf
type: Property
equivalent property: ensures implementation of
comment: Indicates that this Legislation ensures the implementation of another Legislation, for example by modifying national legislations so that they do not contradict to an EU regulation or decision. This implies a legal meaning. Transpositions of EU Directive should be captured with legislationTransposes.
sub property of: legislationApplies
contributor: ELI
domainIncludes: Legislation
isPartOf: pending.schema.org
rangeIncludes: Legislation
source: eli
source: https://github.com/schemaorg/schemaorg/issues/2698

Residence
type: Class
comment: The place where a person lives.
subclass of: Place

adverseOutcome
type: Property
comment: A possible complication and/or side effect of this therapy. If it is known that an adverse outcome is serious (resulting in death, disability, or permanent damage; requiring hospitalization; or otherwise life-threatening or requiring immediate medical attention), tag it as a seriousAdverseOutcome instead.
domainIncludes: MedicalDevice
domainIncludes: TherapeuticProcedure
isPartOf: health-lifesci.schema.org
rangeIncludes: MedicalEntity

IncentiveTypeLoan
type: IncentiveType
comment: An incentive where the recipient can receive additional funding for the purchase/lease of the good/service, which must be paid back.
isPartOf: pending.schema.org
source: https://github.com/schemaorg/schemaorg/issues/3572

EUEnergyEfficiencyCategoryB
type: EUEnergyEfficiencyEnumeration
comment: Represents EU Energy Efficiency Class B as defined in EU energy labeling regulations.
isPartOf: pending.schema.org
source: https://github.com/schemaorg/schemaorg/issues/2670

discussionUrl
type: Property
comment: A link to the page containing the comments of the CreativeWork.
domainIncludes: CreativeWork
rangeIncludes: URL

Neuro
type: PhysicalExam
comment: Neurological system clinical examination.
isPartOf: health-lifesci.schema.org

cutoffTime
type: Property
comment: Order cutoff time allows merchants to describe the time after which they will no longer process orders received on that day. For orders processed after cutoff time, one day gets added to the delivery time estimate. This property is expected to be most typically used via the ShippingRateSettings publication pattern. The time is indicated using the ISO-8601 Time format, e.g. "23:30:00-05:00" would represent 6:30 pm Eastern Standard Time (EST) which is 5 hours behind Coordinated Universal Time (UTC).
domainIncludes: ShippingDeliveryTime
domainIncludes: ServicePeriod
rangeIncludes: Time
source: https://github.com/schemaorg/schemaorg/issues/2506
source: https://github.com/schemaorg/schemaorg/issues/3617

closes
type: Property
comment: The closing hour of the place or service on the given day(s) of the week.
contributor: GoodRelationsTerms
domainIncludes: OpeningHoursSpecification
rangeIncludes: Time

EUEnergyEfficiencyCategoryG
type: EUEnergyEfficiencyEnumeration
comment: Represents EU Energy Efficiency Class G as defined in EU energy labeling regulations.
isPartOf: pending.schema.org
source: https://github.com/schemaorg/schemaorg/issues/2670

borrower
type: Property
comment: A sub property of participant. The person that borrows the object being lent.
sub property of: participant
domainIncludes: LendAction
rangeIncludes: Person

Trip
type: Class
comment: A trip or journey. An itinerary of visits to one or more places.
subclass of: Intangible
contributor: Tourism

Neck
type: PhysicalExam
comment: Neck assessment with clinical examination.
isPartOf: health-lifesci.schema.org

PerformingArtsEvent
type: Class
equivalent class: F31 Performance
comment: Live performance Event of the performing arts (music, theatre, dance, acrobatics, spoken word), including performance art and performative sports (e.g. choreographed forms of martial arts, figure skating, competitive ballroom dancing). Note: Use additionalType to differentiate between productions / shows (PerformanceWork, EventSeries), tours (EventSeries), and individual performances.
subclass of: Event
isPartOf: pending.schema.org
source: https://github.com/schemaorg/schemaorg/issues/4468

FDAcategoryC
type: DrugPregnancyCategory
comment: A designation by the US FDA signifying that animal reproduction studies have shown an adverse effect on the fetus and there are no adequate and well-controlled studies in humans, but potential benefits may warrant use of the drug in pregnant women despite potential risks.
isPartOf: health-lifesci.schema.org

CharitableIncorporatedOrganization
type: UKNonprofitType
comment: CharitableIncorporatedOrganization: Non-profit type referring to a Charitable Incorporated Organization (UK).
isPartOf: pending.schema.org
source: https://github.com/schemaorg/schemaorg/issues/2543

DEJointStockCompanyCharity
type: DENonprofitType
comment: DEJointStockCompanyCharity: Non-profit type referring to a charitable Joint Stock Company (German gAG gemeinnützige Aktiengesellschaft) that has been recognized by the tax authorities as a charitable non-profit.
isPartOf: pending.schema.org
source: https://github.com/schemaorg/schemaorg/issues/3629

recipeInstructions
type: Property
comment: A step in making the recipe, in the form of a single item (document, video, etc.) or an ordered list with HowToStep and/or HowToSection items.
sub property of: step
domainIncludes: Recipe
rangeIncludes: CreativeWork
rangeIncludes: Text
rangeIncludes: ItemList

cvdNumTotBeds
type: Property
comment: numtotbeds - ALL HOSPITAL BEDS: Total number of all inpatient and outpatient beds, including all staffed, ICU, licensed, and overflow (surge) beds used for inpatients or outpatients.
domainIncludes: CDCPMDRecord
isPartOf: pending.schema.org
rangeIncludes: Number
source: https://github.com/schemaorg/schemaorg/issues/2521

WearableSizeGroupMisses
type: WearableSizeGroupEnumeration
comment: Size group "Misses" (also known as "Missy") for wearables.
isPartOf: pending.schema.org
source: https://github.com/schemaorg/schemaorg/issues/2811

hasMolecularFunction
type: Property
comment: Molecular function performed by this BioChemEntity; please use PropertyValue if you want to include any evidence.
domainIncludes: BioChemEntity
isPartOf: pending.schema.org
rangeIncludes: PropertyValue
rangeIncludes: DefinedTerm
rangeIncludes: URL
source: BioChemEntity

Downpayment
type: PriceComponentTypeEnumeration
comment: Represents the downpayment (up-front payment) price component of the total price for an offered product that has additional installment payments.
isPartOf: pending.schema.org
source: https://github.com/schemaorg/schemaorg/issues/2689

Retail
type: DrugCostCategory
comment: The drug's cost represents the retail cost of the drug.
isPartOf: health-lifesci.schema.org

PaymentAutomaticallyApplied
type: PaymentStatusType
comment: An automatic payment system is in place and will be used.

Mountain
type: Class
comment: A mountain, like Mount Whitney or Mount Everest.
subclass of: Landform

ContagiousnessHealthAspect
type: HealthAspectEnumeration
comment: Content about contagion mechanisms and contagiousness information over the topic.
isPartOf: pending.schema.org
source: https://github.com/schemaorg/schemaorg/issues/2374

originatesFrom
type: Property
comment: The vasculature the lymphatic structure originates, or afferents, from.
domainIncludes: LymphaticVessel
isPartOf: health-lifesci.schema.org
rangeIncludes: Vessel

DrinkAction
type: Class
comment: The act of swallowing liquids.
subclass of: ConsumeAction

availableService
type: Property
comment: A medical service available from this provider.
domainIncludes: Hospital
domainIncludes: MedicalClinic
domainIncludes: Physician
isPartOf: health-lifesci.schema.org
rangeIncludes: MedicalProcedure
rangeIncludes: MedicalTest
rangeIncludes: MedicalTherapy

ReservationPending
type: ReservationStatusType
comment: The status of a reservation when a request has been sent, but not confirmed.

WearableSizeSystemBR
type: WearableSizeSystemEnumeration
comment: Brazilian size system for wearables.
isPartOf: pending.schema.org
source: https://github.com/schemaorg/schemaorg/issues/2811

originalMediaLink
type: Property
comment: Link to the page containing an original version of the content, or directly to an online copy of the original MediaObject content, e.g. video file.
domainIncludes: MediaReview
isPartOf: pending.schema.org
rangeIncludes: MediaObject
rangeIncludes: URL
rangeIncludes: WebPage
source: https://github.com/schemaorg/schemaorg/issues/2450

typicalAgeRange
type: Property
comment: The typical expected age range, e.g. '7-9', '11-'.
domainIncludes: Event
domainIncludes: CreativeWork
rangeIncludes: Text

LimitedByGuaranteeCharity
type: UKNonprofitType
comment: LimitedByGuaranteeCharity: Non-profit type referring to a charitable company that is limited by guarantee (UK).
isPartOf: pending.schema.org
source: https://github.com/schemaorg/schemaorg/issues/2543

requirements
type: Property
comment: Component dependency requirements for application. This includes runtime environments and shared libraries that are not included in the application distribution package, but required to run the application (examples: DirectX, Java or .NET runtime).
domainIncludes: SoftwareApplication
rangeIncludes: Text
rangeIncludes: URL
supersededBy: softwareRequirements

BusinessEvent
type: Class
comment: Event type: Business event.
subclass of: Event

MinimumAdvertisedPrice
type: PriceTypeEnumeration
comment: Represents the minimum advertised price ("MAP") (as dictated by the manufacturer) of an offered product.
isPartOf: pending.schema.org
source: https://github.com/schemaorg/schemaorg/issues/2712

contentRating
type: Property
comment: Official rating of a piece of content—for example, 'MPAA PG-13'.
domainIncludes: CreativeWork
rangeIncludes: Text
rangeIncludes: Rating

TrainedAlgorithmicMediaDigitalSource
type: IPTCDigitalSourceEnumeration
comment: Content coded as 'trained algorithmic media' using the IPTC digital source type vocabulary.
isPartOf: pending.schema.org
source: https://github.com/schemaorg/schemaorg/issues/3392

boardingPolicy
type: Property
comment: The type of boarding policy used by the airline (e.g. zone-based or group-based).
domainIncludes: Flight
domainIncludes: Airline
rangeIncludes: BoardingPolicyType

accountId
type: Property
comment: The identifier for the account the payment will be applied to.
sub property of: identifier
domainIncludes: Invoice
rangeIncludes: Text

RiverBodyOfWater
type: Class
comment: A river (for example, the broad majestic Shannon).
subclass of: BodyOfWater

Balance
type: PhysicalActivityCategory
comment: Physical activity that is engaged to help maintain posture and balance.
isPartOf: health-lifesci.schema.org

hasMenuSection
type: Property
comment: A subgrouping of the menu (by dishes, course, serving time period, etc.).
domainIncludes: Menu
domainIncludes: MenuSection
rangeIncludes: MenuSection

arrivalGate
type: Property
comment: Identifier of the flight's arrival gate.
domainIncludes: Flight
rangeIncludes: Text

LegislationObject
type: Class
comment: A specific object or file containing a Legislation. Note that the same Legislation can be published in multiple files. For example, a digitally signed PDF, a plain PDF and an HTML version.
subclass of: Legislation
subclass of: MediaObject
contributor: ELI
isPartOf: pending.schema.org
source: https://github.com/schemaorg/schemaorg/issues/1156
source: eli

LegislativeBuilding
type: Class
comment: A legislative building—for example, the state capitol.
subclass of: GovernmentBuilding

DefinitiveLegalValue
type: LegalValueLevel
comment: Indicates a document for which the text is conclusively what the law says and is legally binding. (e.g. The digitally signed version of an Official Journal.) Something "Definitive" is considered to be also AuthoritativeLegalValue.
contributor: ELI
isPartOf: pending.schema.org
source: https://github.com/schemaorg/schemaorg/issues/1156
source: eli

funder
type: Property
comment: A person or organization that supports (sponsors) something through some kind of financial contribution.
sub property of: sponsor
domainIncludes: MonetaryGrant
domainIncludes: Organization
domainIncludes: Person
domainIncludes: Event
domainIncludes: CreativeWork
domainIncludes: Grant
rangeIncludes: Organization
rangeIncludes: Person

callSign
type: Property
comment: A [callsign](https://en.wikipedia.org/wiki/Call_sign), as used in broadcasting and radio communications to identify people, radio and TV stations, or vehicles.
sub property of: identifier
domainIncludes: BroadcastService
domainIncludes: Vehicle
domainIncludes: Person
isPartOf: pending.schema.org
rangeIncludes: Text
source: https://github.com/schemaorg/schemaorg/issues/2109

UserPageVisits
type: Class
comment: UserInteraction and its subtypes is an old way of talking about users interacting with pages. It is generally better to use Action-based vocabulary, alongside types such as Comment.
subclass of: UserInteraction
supersededBy: InteractionCounter

claimInterpreter
type: Property
comment: For a Claim interpreted from MediaObject content, the interpretedAsClaim property can be used to indicate a claim contained, implied or refined from the content of a MediaObject.
domainIncludes: Claim
isPartOf: pending.schema.org
rangeIncludes: Organization
rangeIncludes: Person
source: https://github.com/schemaorg/schemaorg/issues/2450

FullGameAvailability
type: GameAvailabilityEnumeration
comment: Indicates full game availability.
isPartOf: pending.schema.org
source: https://github.com/schemaorg/schemaorg/issues/3058

ReservationPackage
type: Class
comment: A group of multiple reservations with common values for all sub-reservations.
subclass of: Reservation

hasShippingService
type: Property
comment: Specification of a shipping service offered by the organization.
domainIncludes: OfferShippingDetails
domainIncludes: Organization
isPartOf: pending.schema.org
rangeIncludes: ShippingService
source: https://github.com/schemaorg/schemaorg/issues/3617

structuralClass
type: Property
comment: The name given to how bone physically connects to each other.
domainIncludes: Joint
isPartOf: health-lifesci.schema.org
rangeIncludes: Text

programType
type: Property
comment: The type of educational or occupational program. For example, classroom, internship, alternance, etc.
domainIncludes: EducationalOccupationalProgram
isPartOf: pending.schema.org
rangeIncludes: Text
rangeIncludes: DefinedTerm
source: https://github.com/schemaorg/schemaorg/issues/2460

WearableMeasurementOutsideLeg
type: WearableMeasurementTypeEnumeration
comment: Measurement of the outside leg, for example of pants.
isPartOf: pending.schema.org
source: https://github.com/schemaorg/schemaorg/issues/2811

observationPeriod
type: Property
comment: The length of time an Observation took place over. The format follows `P[0-9]*[Y|M|D|h|m|s]`. For example, P1Y is Period 1 Year, P3M is Period 3 Months, P3h is Period 3 hours.
domainIncludes: Observation
isPartOf: pending.schema.org
rangeIncludes: Text
source: https://github.com/schemaorg/schemaorg/issues/2564

BedAndBreakfast
type: Class
comment: Bed and breakfast. See also the dedicated document on the use of schema.org for marking up hotels and other forms of accommodations.
subclass of: LodgingBusiness

branchOf
type: Property
comment: The larger organization that this local business is a branch of, if any. Not to be confused with (anatomical) branch.
domainIncludes: LocalBusiness
rangeIncludes: Organization
supersededBy: parentOrganization

LeaveAction
type: Class
comment: An agent leaves an event / group with participants/friends at a location.\n\nRelated actions:\n\n* JoinAction: The antonym of LeaveAction.\n* UnRegisterAction: Unlike UnRegisterAction, LeaveAction implies leaving a group/team of people rather than a service.
subclass of: InteractAction

DigitalCaptureDigitalSource
type: IPTCDigitalSourceEnumeration
comment: Content coded as 'digital capture' using the IPTC digital source type vocabulary.
isPartOf: pending.schema.org
source: https://github.com/schemaorg/schemaorg/issues/3392

workExample
type: Property
comment: Example/instance/realization/derivation of the concept of this creative work. E.g. the paperback edition, first edition, or e-book.
contributor: bibex
domainIncludes: CreativeWork
inverseOf: exampleOfWork
rangeIncludes: CreativeWork

BodyMeasurementArm
type: BodyMeasurementTypeEnumeration
comment: Arm length (measured between arms/shoulder line intersection and the prominent wrist bone). Used, for example, to fit shirts.
isPartOf: pending.schema.org
source: https://github.com/schemaorg/schemaorg/issues/2811

postalCodePrefix
type: Property
comment: A defined range of postal codes indicated by a common textual prefix. Used for non-numeric systems such as UK.
domainIncludes: DefinedRegion
rangeIncludes: Text
source: https://github.com/schemaorg/schemaorg/issues/2506

costCurrency
type: Property
comment: The currency (in 3-letter) of the drug cost. See: http://en.wikipedia.org/wiki/ISO_4217.
domainIncludes: DrugCost
isPartOf: health-lifesci.schema.org
rangeIncludes: Text

author
type: Property
comment: The author of this content or rating. Please note that author is special in that HTML 5 provides a special mechanism for indicating authorship via the rel tag. That is equivalent to this and may be used interchangeably.
domainIncludes: Rating
domainIncludes: CreativeWork
rangeIncludes: Organization
rangeIncludes: Person

Nonprofit501e
type: USNonprofitType
comment: Nonprofit501e: Non-profit type referring to Cooperative Hospital Service Organizations.
isPartOf: pending.schema.org
source: https://github.com/schemaorg/schemaorg/issues/2543

numberOfForwardGears
type: Property
comment: The total number of forward gears available for the transmission system of the vehicle.\n\nTypical unit code(s): C62.
contributor: Automotive Ontology Working Group
domainIncludes: Vehicle
rangeIncludes: QuantitativeValue
rangeIncludes: Number

Statement
type: Class
comment: A statement about something, for example a fun or interesting fact. If known, the main entity this statement is about can be indicated using mainEntity. For more formal claims (e.g. in Fact Checking), consider using Claim instead. Use the text property to capture the text of the statement.
subclass of: CreativeWork
isPartOf: pending.schema.org
source: https://github.com/schemaorg/schemaorg/issues/2912

license
type: Property
comment: A license document that applies to this content, typically indicated by URL.
domainIncludes: CreativeWork
rangeIncludes: CreativeWork
rangeIncludes: URL

loanType
type: Property
comment: The type of a loan or credit.
contributor: FIBO
domainIncludes: LoanOrCredit
isPartOf: pending.schema.org
rangeIncludes: Text
rangeIncludes: URL
source: https://github.com/schemaorg/schemaorg/issues/1253

possibleComplication
type: Property
comment: A possible unexpected and unfavorable evolution of a medical condition. Complications may include worsening of the signs or symptoms of the disease, extension of the condition to other organ systems, etc.
domainIncludes: MedicalCondition
isPartOf: health-lifesci.schema.org
rangeIncludes: Text

additionalName
type: Property
comment: An additional name for a Person, can be used for a middle name.
sub property of: alternateName
domainIncludes: Person
rangeIncludes: Text

MixtapeAlbum
type: MusicAlbumProductionType
comment: MixtapeAlbum.
contributor: MBZ

educationalRole
type: Property
comment: An educationalRole of an EducationalAudience.
domainIncludes: EducationalAudience
rangeIncludes: Text

BodyMeasurementBust
type: BodyMeasurementTypeEnumeration
comment: Maximum girth of bust. Used, for example, to fit women's suits.
isPartOf: pending.schema.org
source: https://github.com/schemaorg/schemaorg/issues/2811

conditionsOfAccess
type: Property
comment: Conditions that affect the availability of, or method(s) of access to, an item. Typically used for real world items such as an ArchiveComponent held by an ArchiveOrganization. This property is not suitable for use as a general Web access control mechanism. It is expressed only in natural language.\n\nFor example "Available by appointment from the Reading Room" or "Accessible only from logged-in accounts ".
domainIncludes: CreativeWork
isPartOf: pending.schema.org
rangeIncludes: Text
source: https://github.com/schemaorg/schemaorg/issues/2173

MedicalEnumeration
type: Class
comment: Enumerations related to health and the practice of medicine: A concept that is used to attribute a quality to another concept, as a qualifier, a collection of items or a listing of all of the elements of a set in medicine practice.
subclass of: Enumeration
isPartOf: health-lifesci.schema.org

FundingScheme
type: Class
comment: A FundingScheme combines organizational, project and policy aspects of grant-based funding that sets guidelines, principles and mechanisms to support other kinds of projects and activities. Funding is typically organized via Grant funding. Examples of funding schemes: Swiss Priority Programmes (SPPs); EU Framework 7 (FP7); Horizon 2020; the NIH-R01 Grant Program; Wellcome institutional strategic support fund. For large scale public sector funding, the management and administration of grant awards is often handled by other, dedicated, organizations - FundingAgencys such as ERC, REA, ...
subclass of: Organization
isPartOf: pending.schema.org
source: FundInfoCollab
source: https://github.com/schemaorg/schemaorg/issues/383

CreativeWorkSeason
type: Class
comment: A media season, e.g. TV, radio, video game etc.
subclass of: CreativeWork

isSimilarTo
type: Property
equivalent property: SubstituteProduct
comment: A pointer to another, functionally similar product (or multiple products).
contributor: GoodRelationsTerms
domainIncludes: Product
domainIncludes: Service
rangeIncludes: Service
rangeIncludes: Product

SizeSystemImperial
type: SizeSystemEnumeration
comment: Imperial size system.
isPartOf: pending.schema.org
source: https://github.com/schemaorg/schemaorg/issues/2811

ReturnLabelInBox
type: ReturnLabelSourceEnumeration
comment: Specifies that a return label will be provided by the seller in the shipping box.
isPartOf: pending.schema.org
source: https://github.com/schemaorg/schemaorg/issues/2880

Sculpture
type: Class
comment: A piece of sculpture.
subclass of: CreativeWork

exerciseRelatedDiet
type: Property
comment: A sub property of instrument. The diet used in this action.
sub property of: instrument
domainIncludes: ExerciseAction
isPartOf: health-lifesci.schema.org
rangeIncludes: Diet

currenciesAccepted
type: Property
comment: The currency accepted.\n\nUse standard formats: [ISO 4217 currency format](http://en.wikipedia.org/wiki/ISO_4217), e.g. "USD"; [Ticker symbol](https://en.wikipedia.org/wiki/List_of_cryptocurrencies) for cryptocurrencies, e.g. "BTC"; well known names for [Local Exchange Trading Systems](https://en.wikipedia.org/wiki/Local_exchange_trading_system) (LETS) and other currency types, e.g. "Ithaca HOUR".
domainIncludes: LocalBusiness
rangeIncludes: Text

LiquorStore
type: Class
comment: A shop that sells alcoholic drinks such as wine, beer, whisky and other spirits.
subclass of: Store

SatireOrParodyContent
type: MediaManipulationRatingEnumeration
comment: Content coded 'satire or parody content' in a MediaReview, considered in the context of how it was published or shared. For a VideoObject to be 'satire or parody content': A video that was created as political or humorous commentary and is presented in that context. (Reshares of satire/parody content that do not include relevant context are more likely to fall under the “missing context” rating.) For an ImageObject to be 'satire or parody content': An image that was created as political or humorous commentary and is presented in that context. (Reshares of satire/parody content that do not include relevant context are more likely to fall under the “missing context” rating.) For an ImageObject with embedded text to be 'satire or parody content': An image that was created as political or humorous commentary and is presented in that context. (Reshares of satire/parody content that do not include relevant context are more likely to fall under the “missing context” rating.) For an AudioObject to be 'satire or parody content': Audio that was created as political or humorous commentary and is presented in that context. (Reshares of satire/parody content that do not include relevant context are more likely to fall under the “missing context” rating.)
isPartOf: pending.schema.org
source: https://github.com/schemaorg/schemaorg/issues/2450

childMaxAge
type: Property
comment: Maximal age of the child.
domainIncludes: ParentAudience
rangeIncludes: Number

providerMobility
type: Property
comment: Indicates the mobility of a provided service (e.g. 'static', 'dynamic').
domainIncludes: Service
rangeIncludes: Text

timeToComplete
type: Property
comment: The expected length of time to complete the program if attending full-time.
domainIncludes: EducationalOccupationalProgram
isPartOf: pending.schema.org
rangeIncludes: Duration
source: https://github.com/schemaorg/schemaorg/issues/2289

PresentationDigitalDocument
type: Class
comment: A file containing slides or used for a presentation.
subclass of: DigitalDocument

Nonprofit501c11
type: USNonprofitType
comment: Nonprofit501c11: Non-profit type referring to Teachers' Retirement Fund Associations.
isPartOf: pending.schema.org
source: https://github.com/schemaorg/schemaorg/issues/2543

earlyPrepaymentPenalty
type: Property
comment: The amount to be paid as a penalty in the event of early payment of the loan.
contributor: FIBO
domainIncludes: RepaymentSpecification
isPartOf: pending.schema.org
rangeIncludes: MonetaryAmount
source: https://github.com/schemaorg/schemaorg/issues/1253

requiredMaxAge
type: Property
comment: Audiences defined by a person's maximum age.
domainIncludes: PeopleAudience
rangeIncludes: Integer

Invoice
type: Class
equivalent class: Invoice
comment: A statement of the money due for goods or services; a bill.
subclass of: LegalDocument
subclass of: Intangible

accountMinimumInflow
type: Property
comment: A minimum amount that has to be paid in every month.
contributor: FIBO
domainIncludes: BankAccount
isPartOf: pending.schema.org
rangeIncludes: MonetaryAmount
source: https://github.com/schemaorg/schemaorg/issues/1253

lender
type: Property
comment: A sub property of participant. The person that lends the object being borrowed.
sub property of: participant
domainIncludes: BorrowAction
rangeIncludes: Person
rangeIncludes: Organization

validForMemberTier
type: Property
comment: The membership program tier(s) an Offer (or a PriceSpecification, OfferShippingDetails, or MerchantReturnPolicy under an Offer) is valid for.
domainIncludes: Offer
domainIncludes: PriceSpecification
domainIncludes: OfferShippingDetails
domainIncludes: ShippingService
domainIncludes: MerchantReturnPolicy
isPartOf: pending.schema.org
rangeIncludes: MemberProgramTier
source: https://github.com/schemaorg/schemaorg/issues/3563
source: https://github.com/schemaorg/schemaorg/issues/3617

PreventionIndication
type: Class
comment: An indication for preventing an underlying condition, symptom, etc.
subclass of: MedicalIndication
isPartOf: health-lifesci.schema.org

DrugCost
type: Class
comment: The cost per unit of a medical drug. Note that this type is not meant to represent the price in an offer of a drug for sale; see the Offer type for that. This type will typically be used to tag wholesale or average retail cost of a drug, or maximum reimbursable cost. Costs of medical drugs vary widely depending on how and where they are paid for, so while this type captures some of the variables, costs should be used with caution by consumers of this schema's markup.
subclass of: MedicalEntity
isPartOf: health-lifesci.schema.org

handlingTime
type: Property
comment: The typical delay between the receipt of the order and the goods either leaving the warehouse or being prepared for pickup, in case the delivery method is on site pickup. In the context of ShippingDeliveryTime, Typical properties: minValue, maxValue, unitCode (d for DAY). This is by common convention assumed to mean business days (if a unitCode is used, coded as "d"), i.e. only counting days when the business normally operates. In the context of ShippingService, use the ServicePeriod format, that contains the same information in a structured form, with cut-off time, business days and duration.
sub property of: duration
domainIncludes: ShippingDeliveryTime
domainIncludes: ShippingService
rangeIncludes: QuantitativeValue
rangeIncludes: ServicePeriod
source: https://github.com/schemaorg/schemaorg/issues/2506
source: https://github.com/schemaorg/schemaorg/issues/3617

PublicSwimmingPool
type: Class
comment: A public swimming pool.
subclass of: SportsActivityLocation

AppendAction
type: Class
comment: The act of inserting at the end if an ordered collection.
subclass of: InsertAction

SpeakableSpecification
type: Class
comment: A SpeakableSpecification indicates (typically via xpath or cssSelector) sections of a document that are highlighted as particularly speakable. Instances of this type are expected to be used primarily as values of the speakable property.
subclass of: Intangible
source: https://github.com/schemaorg/schemaorg/issues/1389

beneficiaryBank
type: Property
comment: A bank or bank’s branch, financial institution or international financial institution operating the beneficiary’s bank account or releasing funds for the beneficiary.
contributor: FIBO
domainIncludes: MoneyTransfer
isPartOf: pending.schema.org
rangeIncludes: Text
rangeIncludes: BankOrCreditUnion
source: https://github.com/schemaorg/schemaorg/issues/1253

paymentAccepted
type: Property
comment: Cash, Credit Card, Cryptocurrency, Local Exchange Tradings System, etc.
domainIncludes: LocalBusiness
rangeIncludes: Text

SearchResultsPage
type: Class
comment: Web page type: Search results page.
subclass of: WebPage

Abdomen
type: PhysicalExam
comment: Abdomen clinical examination.
isPartOf: health-lifesci.schema.org

ServiceChannel
type: Class
comment: A means for accessing a service, e.g. a government office location, web site, or phone number.
subclass of: Intangible

shippingDetails
type: Property
comment: Indicates information about the shipping policies and options associated with an Offer.
domainIncludes: Offer
rangeIncludes: OfferShippingDetails
source: https://github.com/schemaorg/schemaorg/issues/2506

timeRequired
type: Property
comment: Approximate or typical time it usually takes to work with or through the content of this work for the typical or target audience.
domainIncludes: CreativeWork
rangeIncludes: Duration

Nonprofit501c18
type: USNonprofitType
comment: Nonprofit501c18: Non-profit type referring to Employee Funded Pension Trust (created before 25 June 1959).
isPartOf: pending.schema.org
source: https://github.com/schemaorg/schemaorg/issues/2543

Distillery
type: Class
comment: A distillery.
subclass of: FoodEstablishment
source: https://github.com/schemaorg/schemaorg/issues/743

PhysicalActivityCategory
type: Class
comment: Categories of physical activity, organized by physiologic classification.
subclass of: Enumeration
isPartOf: health-lifesci.schema.org

naics
type: Property
comment: The North American Industry Classification System (NAICS) code for a particular organization or business person.
sub property of: isClassifiedBy
contributor: GoodRelationsTerms
domainIncludes: Person
domainIncludes: Organization
rangeIncludes: Text

productGroupID
type: Property
comment: Indicates a textual identifier for a ProductGroup.
domainIncludes: ProductGroup
isPartOf: pending.schema.org
rangeIncludes: Text
source: https://github.com/schemaorg/schemaorg/issues/1797

reviewAspect
type: Property
comment: This Review or Rating is relevant to this part or facet of the itemReviewed.
domainIncludes: Guide
domainIncludes: Review
domainIncludes: Rating
rangeIncludes: StructuredValue
rangeIncludes: Text
source: https://github.com/schemaorg/schemaorg/issues/1689

RsvpResponseNo
type: RsvpResponseType
comment: The invitee will not attend.

Map
type: Class
comment: A map.
subclass of: CreativeWork

jobBenefits
type: Property
comment: Description of benefits associated with the job.
domainIncludes: JobPosting
rangeIncludes: Text

branchCode
type: Property
comment: A short textual code (also called "store code") that uniquely identifies a place of business. The code is typically assigned by the parentOrganization and used in structured URLs.\n\nFor example, in the URL http://www.starbucks.co.uk/store-locator/etc/detail/3047 the code "3047" is a branchCode for a particular branch.
domainIncludes: Place
rangeIncludes: Text

Taxon
type: Class
comment: A set of organisms asserted to represent a natural cohesive biological unit.
subclass of: Thing
isPartOf: pending.schema.org
source: bioschemas.org

TelevisionChannel
type: Class
comment: A unique instance of a television BroadcastService on a CableOrSatelliteService lineup.
subclass of: BroadcastChannel

MotorcycleRepair
type: Class
comment: A motorcycle repair shop.
subclass of: AutomotiveBusiness

MeasurementTypeEnumeration
type: Class
comment: Enumeration of common measurement types (or dimensions), for example "chest" for a person, "inseam" for pants, "gauge" for screws, or "wheel" for bicycles.
subclass of: Enumeration
isPartOf: pending.schema.org
source: https://github.com/schemaorg/schemaorg/issues/2811

GovernmentBuilding
type: Class
comment: A government building.
subclass of: CivicStructure

musicArrangement
type: Property
comment: An arrangement derived from the composition.
contributor: MBZ
domainIncludes: MusicComposition
rangeIncludes: MusicComposition

returnPolicySeasonalOverride
type: Property
comment: Seasonal override of a return policy.
domainIncludes: MerchantReturnPolicy
isPartOf: pending.schema.org
rangeIncludes: MerchantReturnPolicySeasonalOverride
source: https://github.com/schemaorg/schemaorg/issues/2880

addOn
type: Property
comment: An additional offer that can only be obtained in combination with the first base offer (e.g. supplements and extensions that are available for a surcharge).
contributor: GoodRelationsTerms
domainIncludes: Offer
rangeIncludes: Offer

usedToDiagnose
type: Property
comment: A condition the test is used to diagnose.
domainIncludes: MedicalTest
isPartOf: health-lifesci.schema.org
rangeIncludes: MedicalCondition

imagingTechnique
type: Property
comment: Imaging technique used.
domainIncludes: ImagingTest
isPartOf: health-lifesci.schema.org
rangeIncludes: MedicalImagingTechnique

returnFees
type: Property
comment: The type of return fees for purchased products (for any return reason).
domainIncludes: MerchantReturnPolicy
domainIncludes: MerchantReturnPolicySeasonalOverride
isPartOf: pending.schema.org
rangeIncludes: ReturnFeesEnumeration
source: https://github.com/schemaorg/schemaorg/issues/2288

deathPlace
type: Property
comment: The place where the person died.
domainIncludes: Person
rangeIncludes: Place

siblings
type: Property
comment: A sibling of the person.
domainIncludes: Person
rangeIncludes: Person
supersededBy: sibling

numberOfAirbags
type: Property
comment: The number or type of airbags in the vehicle.
contributor: Automotive Ontology Working Group
domainIncludes: Vehicle
rangeIncludes: Text
rangeIncludes: Number

serviceSmsNumber
type: Property
comment: The number to access the service by text message.
sub property of: hasAddress
domainIncludes: ServiceChannel
rangeIncludes: ContactPoint

naturalProgression
type: Property
comment: The expected progression of the condition if it is not treated and allowed to progress naturally.
domainIncludes: MedicalCondition
isPartOf: health-lifesci.schema.org
rangeIncludes: Text

articleBody
type: Property
comment: The actual body of the article.
domainIncludes: Article
rangeIncludes: Text

PercutaneousProcedure
type: MedicalProcedureType
comment: A type of medical procedure that involves percutaneous techniques, where access to organs or tissue is achieved via needle-puncture of the skin. For example, catheter-based procedures like stent delivery.
isPartOf: health-lifesci.schema.org

populationType
type: Property
comment: Indicates the populationType common to all members of a StatisticalPopulation or all cases within the scope of a StatisticalVariable.
domainIncludes: StatisticalPopulation
domainIncludes: StatisticalVariable
isPartOf: pending.schema.org
rangeIncludes: Class
source: https://github.com/schemaorg/schemaorg/issues/2291

QuantitativeValue
type: Class
comment: A point value or interval for product characteristics and other purposes.
subclass of: StructuredValue
contributor: good-relations-and-schema-org

WebPage
type: Class
comment: A web page. Every web page is implicitly assumed to be declared to be of type WebPage, so the various properties about that webpage, such as breadcrumb may be used. We recommend explicit declaration if these properties are specified, but if they are found outside of an itemscope, they will be assumed to be about the page.
subclass of: CreativeWork

Error
type: Class
equivalent class: Error
comment: Representation of an Error.
subclass of: Result
subclass of: InstantaneousEvent
isPartOf: pending.schema.org
source: https://github.com/schemaorg/schemaorg/issues/4579

dateModified
type: Property
comment: The date on which the CreativeWork was most recently modified or when the item's entry was modified within a DataFeed.
domainIncludes: CreativeWork
domainIncludes: DataFeedItem
rangeIncludes: DateTime
rangeIncludes: Date

artMedium
type: Property
comment: The material used. (E.g. Oil, Watercolour, Acrylic, Linoprint, Marble, Cyanotype, Digital, Lithograph, DryPoint, Intaglio, Pastel, Woodcut, Pencil, Mixed Media, etc.)
sub property of: material
domainIncludes: VisualArtwork
rangeIncludes: URL
rangeIncludes: Text

purchaseType
type: Property
comment: Optional. The type of purchase the consumer must make in order to qualify for this incentive.
domainIncludes: FinancialIncentive
isPartOf: pending.schema.org
rangeIncludes: PurchaseType
source: https://github.com/schemaorg/schemaorg/issues/3572

MedicalDevice
type: Class
equivalent class: http://purl.bioontology.org/ontology/SNOMEDCT/63653004
comment: Any object used in a medical capacity, such as to diagnose or treat a patient.
subclass of: MedicalEntity
isPartOf: health-lifesci.schema.org

acceptedOffer
type: Property
comment: The offer(s) -- e.g., product, quantity and price combinations -- included in the order.
domainIncludes: Order
rangeIncludes: Offer

interestRate
type: Property
comment: The interest rate, charged or paid, applicable to the financial product. Note: This is different from the calculated annualPercentageRate.
contributor: FIBO
domainIncludes: FinancialProduct
rangeIncludes: QuantitativeValue
rangeIncludes: Number

gameLocation
type: Property
comment: Real or fictional location of the game (or part of game).
domainIncludes: Game
domainIncludes: VideoGameSeries
rangeIncludes: Place
rangeIncludes: URL
rangeIncludes: PostalAddress

recipeCategory
type: Property
comment: The category of the recipe—for example, appetizer, entree, etc.
domainIncludes: Recipe
rangeIncludes: Text

arrivalTerminal
type: Property
comment: Identifier of the flight's arrival terminal.
domainIncludes: Flight
rangeIncludes: Text

DrugClass
type: Class
comment: A class of medical drugs, e.g., statins. Classes can represent general pharmacological class, common mechanisms of action, common physiological effects, etc.
subclass of: MedicalEntity
isPartOf: health-lifesci.schema.org

DigitalFormat
type: MusicReleaseFormatType
comment: DigitalFormat.
contributor: MBZ

eligibleDuration
type: Property
comment: The duration for which the given offer is valid.
contributor: GoodRelationsTerms
domainIncludes: Demand
domainIncludes: Offer
rangeIncludes: QuantitativeValue

HearingImpairedSupported
type: ContactPointOption
comment: Uses devices to support users with hearing impairments.

LimitedAvailability
type: ItemAvailability
comment: Indicates that the item has limited availability.

grantee
type: Property
comment: The person, organization, contact point, or audience that has been granted this permission.
domainIncludes: DigitalDocumentPermission
rangeIncludes: Organization
rangeIncludes: Person
rangeIncludes: ContactPoint
rangeIncludes: Audience

costCategory
type: Property
comment: The category of cost, such as wholesale, retail, reimbursement cap, etc.
domainIncludes: DrugCost
isPartOf: health-lifesci.schema.org
rangeIncludes: DrugCostCategory

WearableSizeGroupInfants
type: WearableSizeGroupEnumeration
comment: Size group "Infants" for wearables.
isPartOf: pending.schema.org
source: https://github.com/schemaorg/schemaorg/issues/2811

iso6523Code
type: Property
comment: An organization identifier as defined in [ISO 6523(-1)](https://en.wikipedia.org/wiki/ISO/IEC_6523). The identifier should be in the `XXXX:YYYYYY:ZZZ` or `XXXX:YYYYYY`format. Where `XXXX` is a 4 digit _ICD_ (International Code Designator), `YYYYYY` is an _OID_ (Organization Identifier) with all formatting characters (dots, dashes, spaces) removed with a maximal length of 35 characters, and `ZZZ` is an optional OPI (Organization Part Identifier) with a maximum length of 35 characters. The various components (ICD, OID, OPI) are joined with a colon character (ASCII `0x3a`). Note that many existing organization identifiers defined as attributes like [leiCode](https://schema.org/leiCode) (`0199`), [duns](https://schema.org/duns) (`0060`) or [GLN](https://schema.org/globalLocationNumber) (`0088`) can be expressed using ISO-6523. If possible, ISO-6523 codes should be preferred to populating [vatID](https://schema.org/vatID) or [taxID](https://schema.org/taxID), as ISO identifiers are less ambiguous.
domainIncludes: Organization
isPartOf: pending.schema.org
rangeIncludes: Text
source: https://github.com/schemaorg/schemaorg/issues/2915

BodyMeasurementHand
type: BodyMeasurementTypeEnumeration
comment: Maximum hand girth (measured over the knuckles of the open right hand excluding thumb, fingers together). Used, for example, to fit gloves.
isPartOf: pending.schema.org
source: https://github.com/schemaorg/schemaorg/issues/2811

Class
equivalent class: Class
comment: A class, also often called a 'Type'; equivalent to rdfs:Class.
subclass of: Intangible
isPartOf: meta.schema.org

HowToTip
type: Class
comment: An explanation in the instructions for how to achieve a result. It provides supplementary information about a technique, supply, author's preference, etc. It can explain what could be done, or what should not be done, but doesn't specify what should be done (see HowToDirection).
subclass of: CreativeWork
subclass of: ListItem

domainIncludes
type: Property
comment: Relates a property to a class that is (one of) the type(s) the property is expected to be used on.
domainIncludes: Property
isPartOf: meta.schema.org
rangeIncludes: Class

CheckInAdvance
type: PaymentMethodType
comment: Payment in advance by sending a check, equivalent to http://purl.org/goodrelations/v1#CheckInAdvance.

roofLoad
type: Property
comment: The permitted total weight of cargo and installations (e.g. a roof rack) on top of the vehicle.\n\nTypical unit code(s): KGM for kilogram, LBR for pound\n\n* Note 1: You can indicate additional information in the name of the QuantitativeValue node.\n* Note 2: You may also link to a QualitativeValue node that provides additional information using valueReference\n* Note 3: Note that you can use minValue and maxValue to indicate ranges.
contributor: Automotive Ontology Working Group
domainIncludes: BusOrCoach
domainIncludes: Car
isPartOf: auto.schema.org
rangeIncludes: QuantitativeValue

isGift
type: Property
comment: Indicates whether the offer was accepted as a gift for someone other than the buyer.
domainIncludes: Order
rangeIncludes: Boolean

announcementLocation
type: Property
comment: Indicates a specific CivicStructure or LocalBusiness associated with the SpecialAnnouncement. For example, a specific testing facility or business with special opening hours. For a larger geographic region like a quarantine of an entire region, use spatialCoverage.
sub property of: spatialCoverage
domainIncludes: SpecialAnnouncement
isPartOf: pending.schema.org
rangeIncludes: LocalBusiness
rangeIncludes: CivicStructure
source: https://github.com/schemaorg/schemaorg/issues/2514

legislationLegalValue
type: Property
equivalent property: legal value
comment: The legal value of this legislation file. The same legislation can be written in multiple files with different legal values. Typically a digitally signed PDF have a "stronger" legal value than the HTML file of the same act.
contributor: ELI
domainIncludes: LegislationObject
isPartOf: pending.schema.org
rangeIncludes: LegalValueLevel
source: eli
source: https://github.com/schemaorg/schemaorg/issues/1156

broadcastAffiliateOf
type: Property
comment: The media network(s) whose content is broadcast on this station.
domainIncludes: BroadcastService
rangeIncludes: Organization

BusinessSupport
type: GovernmentBenefitsType
comment: BusinessSupport: this is a benefit for supporting businesses.
isPartOf: pending.schema.org
source: https://github.com/schemaorg/schemaorg/issues/2534

applicationStartDate
type: Property
comment: The date at which the program begins collecting applications for the next enrollment cycle.
domainIncludes: EducationalOccupationalProgram
isPartOf: pending.schema.org
rangeIncludes: Date
source: https://github.com/schemaorg/schemaorg/issues/2419

codeValue
type: Property
comment: A short textual code that uniquely identifies the value.
sub property of: termCode
domainIncludes: MedicalCode
domainIncludes: CategoryCode
isPartOf: pending.schema.org
rangeIncludes: Text
source: https://github.com/schemaorg/schemaorg/issues/894

energyEfficiencyScaleMin
type: Property
comment: Specifies the least energy efficient class on the regulated EU energy consumption scale for the product category a product belongs to. For example, energy consumption for televisions placed on the market after January 1, 2020 is scaled from D to A+++.
domainIncludes: EnergyConsumptionDetails
isPartOf: pending.schema.org
rangeIncludes: EUEnergyEfficiencyEnumeration
source: https://github.com/schemaorg/schemaorg/issues/2670

sibling
type: Property
comment: A sibling of the person.
domainIncludes: Person
rangeIncludes: Person

CorrectionComment
type: Class
comment: A comment that corrects CreativeWork.
subclass of: Comment
isPartOf: pending.schema.org
source: https://github.com/schemaorg/schemaorg/issues/1950

hasTierRequirement
type: Property
comment: A requirement for a user to join a membership tier, for example: a CreditCard if the tier requires sign up for a credit card, A UnitPriceSpecification if the user is required to pay a (periodic) fee, or a MonetaryAmount if the user needs to spend a minimum amount to join the tier. If a tier is free to join then this property does not need to be specified.
domainIncludes: MemberProgramTier
rangeIncludes: UnitPriceSpecification
rangeIncludes: MonetaryAmount
rangeIncludes: CreditCard
rangeIncludes: Text
source: https://github.com/schemaorg/schemaorg/issues/3563

WearableMeasurementBack
type: WearableMeasurementTypeEnumeration
comment: Measurement of the back section, for example of a jacket.
isPartOf: pending.schema.org
source: https://github.com/schemaorg/schemaorg/issues/2811

Brewery
type: Class
comment: Brewery.
subclass of: FoodEstablishment

MobileWebPlatform
type: DigitalPlatformEnumeration
comment: Represents the broad notion of 'mobile' browsers as a Web Platform.
isPartOf: pending.schema.org
source: https://github.com/schemaorg/schemaorg/issues/3057

IncentiveStatus
type: Class
comment: Enumerates a status for an incentive, such as whether it is active.
subclass of: Enumeration
isPartOf: pending.schema.org
source: https://github.com/schemaorg/schemaorg/issues/3572

Endocrine
type: MedicalSpecialty
comment: A specific branch of medical science that pertains to diagnosis and treatment of disorders of endocrine glands and their secretions.
isPartOf: health-lifesci.schema.org

InternationalTrial
type: MedicalTrialDesign
comment: An international trial.
isPartOf: health-lifesci.schema.org

PregnancyHealthAspect
type: HealthAspectEnumeration
comment: Content discussing pregnancy-related aspects of a health topic.
isPartOf: pending.schema.org
source: https://github.com/schemaorg/schemaorg/issues/2799

OfflineEventAttendanceMode
type: EventAttendanceModeEnumeration
comment: OfflineEventAttendanceMode - an event that is primarily conducted offline.
isPartOf: pending.schema.org
source: https://github.com/schemaorg/schemaorg/issues/1842

WearableMeasurementWidth
type: WearableMeasurementTypeEnumeration
comment: Measurement of the width, for example of shoes.
isPartOf: pending.schema.org
source: https://github.com/schemaorg/schemaorg/issues/2811

creator
type: Property
equivalent property: creator
comment: The creator/author of this CreativeWork. This is the same as the Author property for CreativeWork.
domainIncludes: UserComments
domainIncludes: CreativeWork
rangeIncludes: Organization
rangeIncludes: Person

AutomatedTeller
type: Class
comment: ATM/cash machine.
subclass of: FinancialService

OutletStore
type: Class
comment: An outlet store.
subclass of: Store

TennisComplex
type: Class
comment: A tennis complex.
subclass of: SportsActivityLocation

MediaReview
type: Class
comment: A MediaReview is a more specialized form of Review dedicated to the evaluation of media content online, typically in the context of fact-checking and misinformation. For more general reviews of media in the broader sense, use UserReview, CriticReview or other Review types. This definition is a work in progress. While the MediaManipulationRatingEnumeration list reflects significant community review amongst fact-checkers and others working to combat misinformation, the specific structures for representing media objects, their versions and publication context, are still evolving. Similarly, best practices for the relationship between MediaReview and ClaimReview markup have not yet been finalized.
subclass of: Review
isPartOf: pending.schema.org
source: https://github.com/schemaorg/schemaorg/issues/2450

strengthValue
type: Property
comment: The value of an active ingredient's strength, e.g. 325.
domainIncludes: DrugStrength
isPartOf: health-lifesci.schema.org
rangeIncludes: Number

Dentist
type: Class
comment: A dentist.
subclass of: MedicalBusiness
subclass of: MedicalOrganization
subclass of: LocalBusiness

fuelEfficiency
type: Property
comment: The distance traveled per unit of fuel used; most commonly miles per gallon (mpg) or kilometers per liter (km/L).\n\n* Note 1: There are unfortunately no standard unit codes for miles per gallon or kilometers per liter. Use unitText to indicate the unit of measurement, e.g. mpg or km/L.\n* Note 2: There are two ways of indicating the fuel consumption, fuelConsumption (e.g. 8 liters per 100 km) and fuelEfficiency (e.g. 30 miles per gallon). They are reciprocal.\n* Note 3: Often, the absolute value is useful only when related to driving speed ("at 80 km/h") or usage pattern ("city traffic"). You can use valueReference to link the value for the fuel economy to another value.
contributor: Automotive Ontology Working Group
domainIncludes: Vehicle
rangeIncludes: QuantitativeValue

expectedArrivalFrom
type: Property
comment: The earliest date the package may arrive.
domainIncludes: ParcelDelivery
rangeIncludes: DateTime
rangeIncludes: Date

CollectionPage
type: Class
comment: Web page type: Collection page.
subclass of: WebPage

MedicalRiskFactor
type: Class
comment: A risk factor is anything that increases a person's likelihood of developing or contracting a disease, medical condition, or complication.
subclass of: MedicalEntity
isPartOf: health-lifesci.schema.org

InStoreOnly
type: ItemAvailability
comment: Indicates that the item is available only at physical locations.

CohortStudy
type: MedicalObservationalStudyDesign
comment: Also known as a panel study. A cohort study is a form of longitudinal study used in medicine and social science. It is one type of study design and should be compared with a cross-sectional study. A cohort is a group of people who share a common characteristic or experience within a defined period (e.g., are born, leave school, lose their job, are exposed to a drug or a vaccine, etc.). The comparison group may be the general population from which the cohort is drawn, or it may be another cohort of persons thought to have had little or no exposure to the substance under investigation, but otherwise similar. Alternatively, subgroups within the cohort may be compared with each other.
isPartOf: health-lifesci.schema.org

softwareRequirements
type: Property
comment: Component dependency requirements for application. This includes runtime environments and shared libraries that are not included in the application distribution package, but required to run the application (examples: DirectX, Java or .NET runtime).
domainIncludes: SoftwareApplication
rangeIncludes: SoftwareApplication
rangeIncludes: Text
rangeIncludes: URL

honorificSuffix
type: Property
comment: An honorific suffix following a Person's name such as M.D./PhD/MSCSW.
domainIncludes: Person
rangeIncludes: Text

episodeNumber
type: Property
comment: Position of the episode within an ordered group of episodes.
sub property of: position
domainIncludes: Episode
rangeIncludes: Text
rangeIncludes: Integer

address
type: Property
equivalent property: address
comment: Physical address of the item.
domainIncludes: Place
domainIncludes: Person
domainIncludes: GeoShape
domainIncludes: Organization
domainIncludes: GeoCoordinates
rangeIncludes: Text
rangeIncludes: PostalAddress

AllocateAction
type: Class
comment: The act of organizing tasks/objects/events by associating resources to it.
subclass of: OrganizeAction

Store
type: Class
comment: A retail good store.
subclass of: LocalBusiness

publishedOn
type: Property
comment: A broadcast service associated with the publication event.
domainIncludes: PublicationEvent
rangeIncludes: BroadcastService

inChI
type: Property
comment: Non-proprietary identifier for molecular entity that can be used in printed and electronic data sources thus enabling easier linking of diverse data compilations.
sub property of: hasRepresentation
domainIncludes: MolecularEntity
isPartOf: pending.schema.org
rangeIncludes: Text
source: MolecularEntity

MedicalAudience
type: Class
comment: Target audiences for medical web pages.
subclass of: Audience
subclass of: PeopleAudience
isPartOf: health-lifesci.schema.org

sportsTeam
type: Property
comment: A sub property of participant. The sports team that participated on this action.
sub property of: participant
domainIncludes: ExerciseAction
rangeIncludes: SportsTeam

NightClub
type: Class
comment: A nightclub or discotheque.
subclass of: EntertainmentBusiness

category
type: Property
comment: A category for the item. Greater signs or slashes can be used to informally indicate a category hierarchy.
domainIncludes: Invoice
domainIncludes: Offer
domainIncludes: Recommendation
domainIncludes: Guide
domainIncludes: ActionAccessSpecification
domainIncludes: SpecialAnnouncement
domainIncludes: PhysicalActivity
domainIncludes: Product
domainIncludes: Service
rangeIncludes: Text
rangeIncludes: URL
rangeIncludes: Thing
rangeIncludes: PhysicalActivityCategory
rangeIncludes: CategoryCode
source: https://github.com/schemaorg/schemaorg/issues/1741
source: https://github.com/schemaorg/schemaorg/issues/2490

OrderReturned
type: OrderStatus
comment: OrderStatus representing that an order has been returned.

hasHealthAspect
type: Property
comment: Indicates the aspect or aspects specifically addressed in some HealthTopicContent. For example, that the content is an overview, or that it talks about treatment, self-care, treatments or their side-effects.
domainIncludes: HealthTopicContent
isPartOf: pending.schema.org
rangeIncludes: HealthAspectEnumeration
source: https://github.com/schemaorg/schemaorg/issues/2373

legalRepresentative
type: Property
comment: One or multiple persons who represent this organization legally such as CEO or sole administrator.
domainIncludes: Organization
rangeIncludes: Person

vehicleInteriorColor
type: Property
comment: The color or color combination of the interior of the vehicle.
contributor: Automotive Ontology Working Group
domainIncludes: Vehicle
rangeIncludes: Text

educationalFramework
type: Property
comment: The framework to which the resource being described is aligned.
domainIncludes: AlignmentObject
rangeIncludes: Text

WearableSizeGroupEnumeration
type: Class
comment: Enumerates common size groups (also known as "size types") for wearable products.
subclass of: SizeGroupEnumeration
isPartOf: pending.schema.org
source: https://github.com/schemaorg/schemaorg/issues/2811

totalPaymentDue
type: Property
comment: The total amount due.
domainIncludes: Invoice
rangeIncludes: MonetaryAmount
rangeIncludes: PriceSpecification

acrissCode
type: Property
comment: The ACRISS Car Classification Code is a code used by many car rental companies, for classifying vehicles. ACRISS stands for Association of Car Rental Industry Systems and Standards.
contributor: Automotive Ontology Working Group
domainIncludes: BusOrCoach
domainIncludes: Car
isPartOf: auto.schema.org
rangeIncludes: Text

legislationAmends
type: Property
equivalent property: amends
comment: Another legislation that this legislation amends, introducing legal changes.
sub property of: legislationChanges
contributor: ELI
domainIncludes: Legislation
isPartOf: pending.schema.org
rangeIncludes: Legislation
source: https://github.com/schemaorg/schemaorg/issues/2698
source: eli

AlcoholConsideration
type: AdultOrientedEnumeration
comment: Item contains alcohol or promotes alcohol consumption.
isPartOf: pending.schema.org
source: https://github.com/schemaorg/schemaorg/issues/2989

securityClearanceRequirement
type: Property
comment: A description of any security clearance requirements of the job.
domainIncludes: JobPosting
isPartOf: pending.schema.org
rangeIncludes: Text
rangeIncludes: URL
source: https://github.com/schemaorg/schemaorg/issues/2384

associatedMedia
type: Property
comment: A media object that encodes this CreativeWork. This property is a synonym for encoding.
domainIncludes: CreativeWork
domainIncludes: HyperToc
domainIncludes: HyperTocEntry
rangeIncludes: MediaObject

energyEfficiencyScaleMax
type: Property
comment: Specifies the most energy efficient class on the regulated EU energy consumption scale for the product category a product belongs to. For example, energy consumption for televisions placed on the market after January 1, 2020 is scaled from D to A+++.
domainIncludes: EnergyConsumptionDetails
isPartOf: pending.schema.org
rangeIncludes: EUEnergyEfficiencyEnumeration
source: https://github.com/schemaorg/schemaorg/issues/2670

FollowAction
type: Class
comment: The act of forming a personal connection with someone/something (object) unidirectionally/asymmetrically to get updates polled from.\n\nRelated actions:\n\n* BefriendAction: Unlike BefriendAction, FollowAction implies that the connection is *not* necessarily reciprocal.\n* SubscribeAction: Unlike SubscribeAction, FollowAction implies that the follower acts as an active agent constantly/actively polling for updates.\n* RegisterAction: Unlike RegisterAction, FollowAction implies that the agent is interested in continuing receiving updates from the object.\n* JoinAction: Unlike JoinAction, FollowAction implies that the agent is interested in getting updates from the object.\n* TrackAction: Unlike TrackAction, FollowAction refers to the polling of updates of all aspects of animate objects rather than the location of inanimate objects (e.g. you track a package, but you don't follow it).
subclass of: InteractAction

Room
type: Class
comment: A room is a distinguishable space within a structure, usually separated from other spaces by interior walls (source: Wikipedia, the free encyclopedia, see http://en.wikipedia.org/wiki/Room). See also the dedicated document on the use of schema.org for marking up hotels and other forms of accommodations.
subclass of: Accommodation
contributor: STI Accommodation Ontology

ShippingDeliveryTime
type: Class
comment: ShippingDeliveryTime provides various pieces of information about delivery times for shipping.
subclass of: StructuredValue
source: https://github.com/schemaorg/schemaorg/issues/2506

PublicToilet
type: Class
comment: A public toilet is a room or small building containing one or more toilets (and possibly also urinals) which is available for use by the general public, or by customers or employees of certain businesses.
subclass of: CivicStructure
isPartOf: pending.schema.org
source: https://github.com/schemaorg/schemaorg/issues/1624

loanTerm
type: Property
comment: The duration of the loan or credit agreement.
sub property of: duration
contributor: FIBO
domainIncludes: LoanOrCredit
rangeIncludes: QuantitativeValue

recordedAt
type: Property
comment: The Event where the CreativeWork was recorded. The CreativeWork may capture all or part of the event.
domainIncludes: CreativeWork
inverseOf: recordedIn
rangeIncludes: Event

WearableSizeGroupMens
type: WearableSizeGroupEnumeration
comment: Size group "Mens" for wearables.
isPartOf: pending.schema.org
source: https://github.com/schemaorg/schemaorg/issues/2811

knownVehicleDamages
type: Property
comment: A textual description of known damages, both repaired and unrepaired.
contributor: Automotive Ontology Working Group
domainIncludes: Vehicle
rangeIncludes: Text

vehicleSpecialUsage
type: Property
comment: Indicates whether the vehicle has been used for special purposes, like commercial rental, driving school, or as a taxi. The legislation in many countries requires this information to be revealed when offering a car for sale.
contributor: Automotive Ontology Working Group
domainIncludes: Vehicle
isPartOf: auto.schema.org
rangeIncludes: Text
rangeIncludes: CarUsageType

DatedMoneySpecification
type: Class
comment: A DatedMoneySpecification represents monetary values with optional start and end dates. For example, this could represent an employee's salary over a specific period of time. __Note:__ This type has been superseded by MonetaryAmount, use of that type is recommended.
subclass of: StructuredValue
supersededBy: MonetaryAmount

VideoGame
type: Class
comment: A video game is an electronic game that involves human interaction with a user interface to generate visual feedback on a video device.
subclass of: SoftwareApplication
subclass of: Game

logo
type: Property
equivalent property: logoReferencedDocument
comment: An associated logo.
sub property of: image
contributor: GoodRelationsTerms
domainIncludes: Product
domainIncludes: Brand
domainIncludes: Place
domainIncludes: Organization
domainIncludes: Service
domainIncludes: Certification
rangeIncludes: URL
rangeIncludes: ImageObject

sportsActivityLocation
type: Property
comment: A sub property of location. The sports activity location where this action occurred.
sub property of: location
domainIncludes: ExerciseAction
rangeIncludes: SportsActivityLocation

ScreeningEvent
type: Class
comment: A screening of a movie or other video.
subclass of: Event

playMode
type: Property
comment: Indicates whether this game is multi-player, co-op or single-player. The game can be marked as multi-player, co-op and single-player at the same time.
domainIncludes: VideoGameSeries
domainIncludes: VideoGame
rangeIncludes: GamePlayMode

ParentalSupport
type: GovernmentBenefitsType
comment: ParentalSupport: this is a benefit for parental support.
isPartOf: pending.schema.org
source: https://github.com/schemaorg/schemaorg/issues/2534

paymentMethodId
type: Property
equivalent property: PaymentMeansID
comment: An identifier for the method of payment used (e.g. the last 4 digits of the credit card).
domainIncludes: Invoice
domainIncludes: Order
rangeIncludes: Text

ControlAction
type: Class
comment: An agent controls a device or application.
subclass of: Action

interactionCount
type: Property
comment: This property is deprecated, alongside the UserInteraction types on which it depended.
supersededBy: interactionStatistic

VenueMap
type: MapCategoryType
comment: A venue map (e.g. for malls, auditoriums, museums, etc.).

estimatesRiskOf
type: Property
comment: The condition, complication, or symptom whose risk is being estimated.
domainIncludes: MedicalRiskEstimator
isPartOf: health-lifesci.schema.org
rangeIncludes: MedicalEntity

webCheckinTime
type: Property
comment: The time when a passenger can check into the flight online.
domainIncludes: Flight
rangeIncludes: DateTime

Vessel
type: Class
comment: A component of the human body circulatory system comprised of an intricate network of hollow tubes that transport blood throughout the entire body.
subclass of: AnatomicalStructure
isPartOf: health-lifesci.schema.org

Landform
type: Class
comment: A landform or physical feature. Landform elements include mountains, plains, lakes, rivers, seascape and oceanic waterbody interface features such as bays, peninsulas, seas and so forth, including sub-aqueous terrain features such as submersed mountain ranges, volcanoes, and the great ocean basins.
subclass of: Place

ApprovedIndication
type: Class
comment: An indication for a medical therapy that has been formally specified or approved by a regulatory body that regulates use of the therapy; for example, the US FDA approves indications for most drugs in the US.
subclass of: MedicalIndication
isPartOf: health-lifesci.schema.org

PaintAction
type: Class
comment: The act of producing a painting, typically with paint and canvas as instruments.
subclass of: CreateAction

SteeringPositionValue
type: Class
comment: A value indicating a steering position.
subclass of: QualitativeValue
contributor: Automotive Ontology Working Group

Manuscript
type: Class
comment: A book, document, or piece of music written by hand rather than typed or printed.
subclass of: CreativeWork
isPartOf: pending.schema.org
source: https://github.com/schemaorg/schemaorg/issues/1448

Diagnostic
type: MedicalDevicePurpose
comment: A medical device used for diagnostic purposes.
isPartOf: health-lifesci.schema.org

characterName
type: Property
comment: The name of a character played in some acting or performing role, i.e. in a PerformanceRole.
domainIncludes: PerformanceRole
rangeIncludes: Text

CompilationAlbum
type: MusicAlbumProductionType
comment: CompilationAlbum.
contributor: MBZ

ComedyClub
type: Class
comment: A comedy club.
subclass of: EntertainmentBusiness

departureTerminal
type: Property
comment: Identifier of the flight's departure terminal.
domainIncludes: Flight
rangeIncludes: Text

numberOfRooms
type: Property
comment: The number of rooms (excluding bathrooms and closets) of the accommodation or lodging business. Typical unit code(s): ROM for room or C62 for no unit. The type of room can be put in the unitText property of the QuantitativeValue.
contributor: STI Accommodation Ontology
domainIncludes: Suite
domainIncludes: SingleFamilyResidence
domainIncludes: Accommodation
domainIncludes: FloorPlan
domainIncludes: Apartment
domainIncludes: House
domainIncludes: LodgingBusiness
rangeIncludes: QuantitativeValue
rangeIncludes: Number

MonetaryAmount
type: Class
comment: A monetary value or range. This type can be used to describe an amount of money such as $50 USD, or a range as in describing a bank account being suitable for a balance between £1,000 and £1,000,000 GBP, or the value of a salary, etc. It is recommended to use PriceSpecification Types to describe the price of an Offer, Invoice, etc.
subclass of: StructuredValue
contributor: FIBO

ReturnLabelDownloadAndPrint
type: ReturnLabelSourceEnumeration
comment: Indicated that a return label must be downloaded and printed by the customer.
isPartOf: pending.schema.org
source: https://github.com/schemaorg/schemaorg/issues/2880

DigitalAudioTapeFormat
type: MusicReleaseFormatType
comment: DigitalAudioTapeFormat.
contributor: MBZ

LowCalorieDiet
type: RestrictedDiet
comment: A diet focused on reduced calorie intake.

potentialUse
type: Property
comment: Intended use of the BioChemEntity by humans.
domainIncludes: ChemicalSubstance
domainIncludes: MolecularEntity
isPartOf: pending.schema.org
rangeIncludes: DefinedTerm
source: ChemicalSubstance

WearableMeasurementCup
type: WearableMeasurementTypeEnumeration
comment: Measurement of the cup, for example of a bra.
isPartOf: pending.schema.org
source: https://github.com/schemaorg/schemaorg/issues/2811

ListenAction
type: Class
comment: The act of consuming audio content.
subclass of: ConsumeAction

Preschool
type: Class
comment: A preschool.
subclass of: EducationalOrganization

performerIn
type: Property
comment: Event that this person is a performer or participant in.
domainIncludes: Person
rangeIncludes: Event

DefenceEstablishment
type: Class
comment: A defence establishment, such as an army or navy base.
subclass of: GovernmentBuilding

seatingCapacity
type: Property
comment: The number of persons that can be seated (e.g. in a vehicle), both in terms of the physical space available, and in terms of limitations set by law.\n\nTypical unit code(s): C62 for persons.
contributor: Automotive Ontology Working Group
domainIncludes: Vehicle
isPartOf: auto.schema.org
rangeIncludes: QuantitativeValue
rangeIncludes: Number

sameAs
type: Property
comment: URL of a reference Web page that unambiguously indicates the item's identity. E.g. the URL of the item's Wikipedia page, Wikidata entry, or official website.
domainIncludes: Thing
rangeIncludes: URL

AllWheelDriveConfiguration
type: DriveWheelConfigurationValue
comment: All-wheel Drive is a transmission layout where the engine drives all four wheels.
contributor: Automotive Ontology Working Group

orderDate
type: Property
equivalent property: OrderDate
comment: Date order was placed.
sub property of: hasDate
domainIncludes: Order
rangeIncludes: Date
rangeIncludes: DateTime

BodyMeasurementHead
type: BodyMeasurementTypeEnumeration
comment: Maximum girth of head above the ears. Used, for example, to fit hats.
isPartOf: pending.schema.org
source: https://github.com/schemaorg/schemaorg/issues/2811

gameTip
type: Property
comment: Links to tips, tactics, etc.
domainIncludes: VideoGame
rangeIncludes: CreativeWork

ReimbursementCap
type: DrugCostCategory
comment: The drug's cost represents the maximum reimbursement paid by an insurer for the drug.
isPartOf: health-lifesci.schema.org

competencyRequired
type: Property
comment: Knowledge, skill, ability or personal attribute that must be demonstrated by a person or other entity in order to do something such as earn an Educational Occupational Credential or understand a LearningResource.
domainIncludes: LearningResource
domainIncludes: EducationalOccupationalCredential
isPartOf: pending.schema.org
rangeIncludes: Text
rangeIncludes: URL
rangeIncludes: DefinedTerm
source: https://github.com/schemaorg/schemaorg/issues/1779

FullRefund
type: RefundTypeEnumeration
comment: Specifies that a refund can be done in the full amount the customer paid for the product.
isPartOf: pending.schema.org
source: https://github.com/schemaorg/schemaorg/issues/2288

EducationalOrganization
type: Class
comment: An educational organization.
subclass of: CivicStructure
subclass of: Organization

printColumn
type: Property
comment: The number of the column in which the NewsArticle appears in the print edition.
domainIncludes: NewsArticle
rangeIncludes: Text

educationalAlignment
type: Property
comment: An alignment to an established educational framework. This property should not be used where the nature of the alignment can be described using a simple property, for example to express that a resource teaches or assesses a competency.
domainIncludes: CreativeWork
domainIncludes: LearningResource
rangeIncludes: AlignmentObject

Newspaper
type: Class
comment: A publication containing information about varied topics that are pertinent to general information, a geographic area, or a specific subject matter (i.e. business, culture, education). Often published daily.
subclass of: Periodical
isPartOf: bib.schema.org
source: Newspaper

colleagues
type: Property
comment: A colleague of the person.
domainIncludes: Person
rangeIncludes: Person
supersededBy: colleague

bioChemInteraction
type: Property
comment: A BioChemEntity that is known to interact with this item.
domainIncludes: BioChemEntity
isPartOf: pending.schema.org
rangeIncludes: BioChemEntity
source: www.bioschemas.org

saturatedFatContent
type: Property
comment: The number of grams of saturated fat.
domainIncludes: NutritionInformation
rangeIncludes: Mass

mpn
type: Property
equivalent property: manufacturerAssignedId
comment: The Manufacturer Part Number (MPN) of the product, or the product to which the offer refers.
contributor: GoodRelationsTerms
domainIncludes: Demand
domainIncludes: Product
domainIncludes: Offer
rangeIncludes: Text

newsUpdatesAndGuidelines
type: Property
comment: Indicates a page with news updates and guidelines. This could often be (but is not required to be) the main page containing SpecialAnnouncement markup on a site.
domainIncludes: SpecialAnnouncement
isPartOf: pending.schema.org
rangeIncludes: WebContent
rangeIncludes: URL
source: https://github.com/schemaorg/schemaorg/issues/2490

firstAppearance
type: Property
comment: Indicates the first known occurrence of a Claim in some CreativeWork.
sub property of: workExample
domainIncludes: Claim
isPartOf: pending.schema.org
rangeIncludes: CreativeWork
source: https://github.com/schemaorg/schemaorg/issues/1828

GameAvailabilityEnumeration
type: Class
comment: For a VideoGame, such as used with a PlayGameAction, an enumeration of the kind of game availability offered.
subclass of: Enumeration
isPartOf: pending.schema.org
source: https://github.com/schemaorg/schemaorg/issues/3058

sensoryUnit
type: Property
comment: The neurological pathway extension that inputs and sends information to the brain or spinal cord.
domainIncludes: Nerve
isPartOf: health-lifesci.schema.org
rangeIncludes: SuperficialAnatomy
rangeIncludes: AnatomicalStructure

reservedTicket
type: Property
comment: A ticket associated with the reservation.
domainIncludes: Reservation
rangeIncludes: Ticket

Gynecologic
type: MedicalSpecialty
comment: A specific branch of medical science that pertains to the health care of women, particularly in the diagnosis and treatment of disorders affecting the female reproductive system.
subclass of: MedicalBusiness
isPartOf: health-lifesci.schema.org

Pathology
type: MedicalSpecialty
comment: A specific branch of medical science that is concerned with the study of the cause, origin and nature of a disease state, including its consequences as a result of manifestation of the disease. In clinical care, the term is used to designate a branch of medicine using laboratory tests to diagnose and determine the prognostic significance of illness.
isPartOf: health-lifesci.schema.org

incentiveType
type: Property
comment: The type of incentive offered (tax credit/rebate, tax deduction, tax waiver, subsidies, etc.).
domainIncludes: FinancialIncentive
isPartOf: pending.schema.org
rangeIncludes: IncentiveType
source: https://github.com/schemaorg/schemaorg/issues/3572

Chiropractic
type: MedicineSystem
comment: A system of medicine focused on the relationship between the body's structure, mainly the spine, and its functioning.
isPartOf: health-lifesci.schema.org

nonprofitStatus
type: Property
comment: nonprofitStatus indicates the legal status of a non-profit organization in its primary place of business.
domainIncludes: Organization
isPartOf: pending.schema.org
rangeIncludes: NonprofitType
source: https://github.com/schemaorg/schemaorg/issues/2543

Optician
type: Class
comment: A store that sells reading glasses and similar devices for improving vision.
subclass of: MedicalBusiness
isPartOf: health-lifesci.schema.org

supersededBy
type: Property
comment: Relates a term (i.e. a property, class or enumeration) to one that supersedes it.
domainIncludes: Enumeration
domainIncludes: Property
domainIncludes: Class
isPartOf: meta.schema.org
rangeIncludes: Enumeration
rangeIncludes: Property
rangeIncludes: Class

CurrencyConversionService
type: Class
comment: A service to convert funds from one currency to another currency.
subclass of: FinancialProduct
contributor: FIBO

ParcelDelivery
type: Class
comment: The delivery of a parcel either via the postal service or a commercial service.
subclass of: Intangible

GolfCourse
type: Class
comment: A golf course.
subclass of: SportsActivityLocation

cookTime
type: Property
comment: The time it takes to actually cook the dish, in [ISO 8601 duration format](http://en.wikipedia.org/wiki/ISO_8601).
sub property of: performTime
domainIncludes: Recipe
rangeIncludes: Duration

bed
type: Property
comment: The type of bed or beds included in the accommodation. For the single case of just one bed of a certain type, you use bed directly with a text. If you want to indicate the quantity of a certain kind of bed, use an instance of BedDetails. For more detailed information, use the amenityFeature property.
contributor: STI Accommodation Ontology
domainIncludes: Suite
domainIncludes: Accommodation
domainIncludes: HotelRoom
rangeIncludes: BedDetails
rangeIncludes: BedType
rangeIncludes: Text

Book
type: Class
comment: A book.
subclass of: CreativeWork

EnrollingByInvitation
type: MedicalStudyStatus
comment: Enrolling participants by invitation only.
isPartOf: health-lifesci.schema.org

Recruiting
type: MedicalStudyStatus
comment: Recruiting participants.
isPartOf: health-lifesci.schema.org

CreditCard
type: Class
comment: A card payment method of a particular brand or name. Used to mark up a particular payment method and/or the financial product/service that supplies the card account.\n\nCommonly used values:\n\n* http://purl.org/goodrelations/v1#AmericanExpress\n* http://purl.org/goodrelations/v1#DinersClub\n* http://purl.org/goodrelations/v1#Discover\n* http://purl.org/goodrelations/v1#JCB\n* http://purl.org/goodrelations/v1#MasterCard\n* http://purl.org/goodrelations/v1#VISA
subclass of: PaymentCard
subclass of: LoanOrCredit
contributor: FIBO
contributor: good-relations-and-schema-org

coursePrerequisites
type: Property
comment: Requirements for taking the Course. May be completion of another Course or a textual description like "permission of instructor". Requirements may be a pre-requisite competency, referenced using AlignmentObject.
domainIncludes: Course
rangeIncludes: Text
rangeIncludes: Course
rangeIncludes: AlignmentObject

RecyclingCenter
type: Class
comment: A recycling center.
subclass of: LocalBusiness

QuoteAction
type: Class
comment: An agent quotes/estimates/appraises an object/product/service with a price at a location/store.
subclass of: TradeAction

translationOfWork
type: Property
comment: The work that this work has been translated from. E.g. 物种起源 is a translationOf “On the Origin of Species”.
domainIncludes: CreativeWork
inverseOf: workTranslation
isPartOf: bib.schema.org
rangeIncludes: CreativeWork

Hematologic
type: MedicalSpecialty
comment: A specific branch of medical science that pertains to diagnosis and treatment of disorders of blood and blood producing organs.
isPartOf: health-lifesci.schema.org

numberOfSeasons
type: Property
comment: The number of seasons in this series.
domainIncludes: VideoGameSeries
domainIncludes: RadioSeries
domainIncludes: TVSeries
rangeIncludes: Integer

StatusEnumeration
type: Class
comment: Lists or enumerations dealing with status types.
subclass of: Enumeration
source: https://github.com/schemaorg/schemaorg/issues/2604

MedicalGuidelineContraindication
type: Class
comment: A guideline contraindication that designates a process as harmful and where quality of the data supporting the contraindication is sound.
subclass of: MedicalGuideline
isPartOf: health-lifesci.schema.org

AerobicActivity
type: PhysicalActivityCategory
comment: Physical activity of relatively low intensity that depends primarily on the aerobic energy-generating process; during activity, the aerobic metabolism uses oxygen to adequately meet energy demands during exercise.
isPartOf: health-lifesci.schema.org

OrderStatus
type: Class
comment: Enumerated status values for Order.
subclass of: StatusEnumeration

baseSalary
type: Property
comment: The base salary of the job or of an employee in an EmployeeRole.
domainIncludes: EmployeeRole
domainIncludes: JobPosting
rangeIncludes: PriceSpecification
rangeIncludes: Number
rangeIncludes: MonetaryAmount

MarryAction
type: Class
comment: The act of marrying a person.
subclass of: InteractAction

CassetteFormat
type: MusicReleaseFormatType
comment: CassetteFormat.
contributor: MBZ

dosageForm
type: Property
comment: A dosage form in which this drug/supplement is available, e.g. 'tablet', 'suspension', 'injection'.
domainIncludes: Drug
isPartOf: health-lifesci.schema.org
rangeIncludes: Text

freeShippingThreshold
type: Property
comment: A monetary value above (or at) which the shipping rate becomes free. Intended to be used via an OfferShippingDetails with shippingSettingsLink matching this ShippingRateSettings.
domainIncludes: ShippingRateSettings
rangeIncludes: DeliveryChargeSpecification
rangeIncludes: MonetaryAmount
source: https://github.com/schemaorg/schemaorg/issues/2506

Course
type: Class
comment: A description of an educational course which may be offered as distinct instances which take place at different times or take place at different locations, or be offered through different media or modes of study. An educational course is a sequence of one or more educational events and/or creative works which aims to build knowledge, competence or ability of learners.
subclass of: LearningResource
subclass of: CreativeWork

partOfSeason
type: Property
comment: The season to which this episode belongs.
sub property of: isPartOf
domainIncludes: Clip
domainIncludes: Episode
rangeIncludes: CreativeWorkSeason

numberOfPartialBathrooms
type: Property
comment: Number of partial bathrooms - The total number of half and ¼ bathrooms in an Accommodation. This corresponds to the [BathroomsPartial field in RESO](https://ddwiki.reso.org/display/DDW17/BathroomsPartial+Field).
domainIncludes: Accommodation
domainIncludes: FloorPlan
isPartOf: pending.schema.org
rangeIncludes: Number
source: https://github.com/schemaorg/schemaorg/issues/2373

Online
type: GameServerStatus
comment: Game server status: Online. Server is available.

cholesterolContent
type: Property
comment: The number of milligrams of cholesterol.
domainIncludes: NutritionInformation
rangeIncludes: Mass

priceSpecification
type: Property
equivalent class: AmountType
comment: One or more detailed price specifications, indicating the unit price and delivery or payment charges.
contributor: GoodRelationsTerms
domainIncludes: DonateAction
domainIncludes: Offer
domainIncludes: Demand
domainIncludes: TradeAction
rangeIncludes: PriceSpecification

endTime
type: Property
comment: The endTime of something. For a reserved event or service (e.g. FoodEstablishmentReservation), the time that it is expected to end. For actions that span a period of time, when the action was performed. E.g. John wrote a book from January to *December*. For media, including audio and video, it's the time offset of the end of a clip within a larger file.\n\nNote that Event uses startDate/endDate instead of startTime/endTime, even when describing dates with times. This situation may be clarified in future revisions.
domainIncludes: InteractionCounter
domainIncludes: Schedule
domainIncludes: Action
domainIncludes: FoodEstablishmentReservation
domainIncludes: MediaObject
rangeIncludes: DateTime
rangeIncludes: Time
source: https://github.com/schemaorg/schemaorg/issues/2493

Intangible
type: Class
comment: A utility class that serves as the umbrella for a number of 'intangible' things such as quantities, structured values, etc.
subclass of: Thing

isPartOf
type: Property
comment: Indicates an item or CreativeWork that this item, or CreativeWork (in some sense), is part of.
domainIncludes: CreativeWork
inverseOf: hasPart
rangeIncludes: CreativeWork
rangeIncludes: URL

mentions
type: Property
comment: Indicates that the CreativeWork contains a reference to, but is not necessarily about a concept.
domainIncludes: CreativeWork
rangeIncludes: Thing

EmailMessage
type: Class
comment: An email message.
subclass of: Message

associatedClaimReview
type: Property
comment: An associated ClaimReview, related by specific common content, topic or claim. The expectation is that this property would be most typically used in cases where a single activity is conducting both claim reviews and media reviews, in which case relatedMediaReview would commonly be used on a ClaimReview, while associatedClaimReview would be used on MediaReview.
sub property of: associatedReview
domainIncludes: Review
isPartOf: pending.schema.org
rangeIncludes: Review
source: https://github.com/schemaorg/schemaorg/issues/2450

partOfOrder
type: Property
equivalent property: ReferencedOrder
comment: The overall order the items in this delivery were included in.
sub property of: refersTo
domainIncludes: ParcelDelivery
rangeIncludes: Order

DataFeed
type: Class
comment: A single feed providing structured information about one or more entities or topics.
subclass of: Dataset

drugClass
type: Property
comment: The class of drug this belongs to (e.g., statins).
domainIncludes: Drug
isPartOf: health-lifesci.schema.org
rangeIncludes: DrugClass

validThrough
type: Property
equivalent property: hasEndDate
comment: The date after when the item is not valid. For example the end of an offer, salary period, or a period of opening hours.
contributor: GoodRelationsTerms
domainIncludes: Offer
domainIncludes: PriceSpecification
domainIncludes: Demand
domainIncludes: OpeningHoursSpecification
domainIncludes: LocationFeatureSpecification
domainIncludes: MonetaryAmount
domainIncludes: JobPosting
domainIncludes: FinancialIncentive
rangeIncludes: DateTime
rangeIncludes: Date

measurementQualifier
type: Property
comment: Provides additional qualification to an observation. For example, a GDP observation measures the Nominal value.
domainIncludes: StatisticalVariable
domainIncludes: Observation
isPartOf: pending.schema.org
rangeIncludes: Enumeration
source: https://github.com/schemaorg/schemaorg/issues/2564

boardingGroup
type: Property
comment: The airline-specific indicator of boarding order / preference.
domainIncludes: FlightReservation
rangeIncludes: Text

ReplyAction
type: Class
comment: The act of responding to a question/message asked/sent by the object. Related to AskAction.\n\nRelated actions:\n\n* AskAction: Appears generally as an origin of a ReplyAction.
subclass of: CommunicateAction

measuredProperty
type: Property
comment: The measuredProperty of an Observation, typically via its StatisticalVariable. There are various kinds of applicable Property: a schema.org property, a property from other RDF-compatible systems, e.g. W3C RDF Data Cube, Data Commons, Wikidata, or schema.org extensions such as [GS1's](https://www.gs1.org/voc/?show=properties).
domainIncludes: Observation
domainIncludes: StatisticalVariable
isPartOf: pending.schema.org
rangeIncludes: Property
source: https://github.com/schemaorg/schemaorg/issues/2291

applicationDeadline
type: Property
comment: The date on which the program stops collecting applications for the next enrollment cycle. Flexible application deadlines (for example, a program with rolling admissions) can be described in a textual string, rather than as a DateTime.
domainIncludes: EducationalOccupationalProgram
isPartOf: pending.schema.org
rangeIncludes: Date
rangeIncludes: Text
source: https://github.com/schemaorg/schemaorg/issues/2419

HealthcareConsideration
type: AdultOrientedEnumeration
comment: Item is a pharmaceutical (e.g., a prescription or OTC drug) or a restricted medical device.
isPartOf: pending.schema.org
source: https://github.com/schemaorg/schemaorg/issues/2989

subStructure
type: Property
comment: Component (sub-)structure(s) that comprise this anatomical structure.
domainIncludes: AnatomicalStructure
isPartOf: health-lifesci.schema.org
rangeIncludes: AnatomicalStructure

targetCollection
type: Property
comment: A sub property of object. The collection target of the action.
sub property of: object
domainIncludes: UpdateAction
rangeIncludes: Thing

ItemListUnordered
type: ItemListOrderType
comment: An ItemList ordered with no explicit order.

gtin12
type: Property
comment: The GTIN-12 code of the product, or the product to which the offer refers. The GTIN-12 is the 12-digit GS1 Identification Key composed of a U.P.C. Company Prefix, Item Reference, and Check Digit used to identify trade items. See [GS1 GTIN Summary](http://www.gs1.org/barcodes/technical/idkeys/gtin) for more details.
sub property of: identifier
sub property of: gtin
domainIncludes: Demand
domainIncludes: Product
domainIncludes: Offer
rangeIncludes: Text

Nonprofit501c5
type: USNonprofitType
comment: Nonprofit501c5: Non-profit type referring to Labor, Agricultural and Horticultural Organizations.
isPartOf: pending.schema.org
source: https://github.com/schemaorg/schemaorg/issues/2543

gtin8
type: Property
comment: The GTIN-8 code of the product, or the product to which the offer refers. This code is also known as EAN/UCC-8 or 8-digit EAN. See [GS1 GTIN Summary](http://www.gs1.org/barcodes/technical/idkeys/gtin) for more details.
sub property of: gtin
sub property of: identifier
contributor: GoodRelationsTerms
domainIncludes: Offer
domainIncludes: Demand
domainIncludes: Product
rangeIncludes: Text

unitCode
type: Property
comment: The unit of measurement given using the UN/CEFACT Common Code (3 characters) or a URL. Other codes than the UN/CEFACT Common Code may be used with a prefix followed by a colon.
contributor: GoodRelationsTerms
domainIncludes: QuantitativeValue
domainIncludes: UnitPriceSpecification
domainIncludes: PropertyValue
domainIncludes: TypeAndQuantityNode
rangeIncludes: Text
rangeIncludes: URL

Appearance
type: PhysicalExam
comment: Appearance assessment with clinical examination.
isPartOf: health-lifesci.schema.org

targetPopulation
type: Property
comment: Characteristics of the population for which this is intended, or which typically uses it, e.g. 'adults'.
domainIncludes: DoseSchedule
domainIncludes: DietarySupplement
isPartOf: health-lifesci.schema.org
rangeIncludes: Text

EmployerAggregateRating
type: Class
comment: An aggregate rating of an Organization related to its role as an employer.
subclass of: AggregateRating
source: https://github.com/schemaorg/schemaorg/issues/1689

carrierRequirements
type: Property
comment: Specifies specific carrier(s) requirements for the application (e.g. an application may only work on a specific carrier network).
domainIncludes: MobileApplication
rangeIncludes: Text

BankAccount
type: Class
equivalent class: BankAccount
comment: A product or service offered by a bank whereby one may deposit, withdraw or transfer money and in some cases be paid interest.
subclass of: FinancialProduct
contributor: FIBO

programmingModel
type: Property
comment: Indicates whether API is managed or unmanaged.
domainIncludes: APIReference
rangeIncludes: Text

SearchRescueOrganization
type: Class
comment: A Search and Rescue organization of some kind.
subclass of: Organization
isPartOf: pending.schema.org
source: https://github.com/schemaorg/schemaorg/issues/3052

responsibilities
type: Property
comment: Responsibilities associated with this role or Occupation.
domainIncludes: Occupation
domainIncludes: JobPosting
rangeIncludes: Text
source: https://github.com/schemaorg/schemaorg/issues/1698

Wholesale
type: DrugCostCategory
comment: The drug's cost represents the wholesale acquisition cost of the drug.
isPartOf: health-lifesci.schema.org

frequency
type: Property
comment: How often the dose is taken, e.g. 'daily'.
domainIncludes: DoseSchedule
isPartOf: health-lifesci.schema.org
rangeIncludes: Text

arrivalPlatform
type: Property
comment: The platform where the train arrives.
domainIncludes: TrainTrip
rangeIncludes: Text

healthPlanCoinsuranceRate
type: Property
comment: The rate of coinsurance expressed as a number between 0.0 and 1.0.
domainIncludes: HealthPlanCostSharingSpecification
isPartOf: pending.schema.org
rangeIncludes: Number
source: https://github.com/schemaorg/schemaorg/issues/1062

globalLocationNumber
type: Property
equivalent property: globalLocationNumber
equivalent property: gLNId
comment: The [Global Location Number](http://www.gs1.org/gln) (GLN, sometimes also referred to as International Location Number or ILN) of the respective organization, person, or place. The GLN is a 13-digit number used to identify parties and physical locations.
sub property of: identifier
contributor: GoodRelationsTerms
domainIncludes: Organization
domainIncludes: Person
domainIncludes: Place
rangeIncludes: Text

valueName
type: Property
comment: Indicates the name of the PropertyValueSpecification to be used in URL templates and form encoding in a manner analogous to HTML's input@name.
domainIncludes: PropertyValueSpecification
rangeIncludes: Text

contraindication
type: Property
comment: A contraindication for this therapy.
domainIncludes: MedicalTherapy
domainIncludes: MedicalDevice
isPartOf: health-lifesci.schema.org
rangeIncludes: Text
rangeIncludes: MedicalContraindication

causeOf
type: Property
comment: The condition, complication, symptom, sign, etc. caused.
domainIncludes: MedicalCause
inverseOf: cause
isPartOf: health-lifesci.schema.org
rangeIncludes: MedicalEntity

TieAction
type: Class
comment: The act of reaching a draw in a competitive activity.
subclass of: AchieveAction

accessCode
type: Property
comment: Password, PIN, or access code needed for delivery (e.g. from a locker).
domainIncludes: DeliveryEvent
rangeIncludes: Text

accelerationTime
type: Property
comment: The time needed to accelerate the vehicle from a given start velocity to a given target velocity.\n\nTypical unit code(s): SEC for seconds\n\n* Note: There are unfortunately no standard unit codes for seconds/0..100 km/h or seconds/0..60 mph. Simply use "SEC" for seconds and indicate the velocities in the name of the QuantitativeValue, or use valueReference with a QuantitativeValue of 0..60 mph or 0..100 km/h to specify the reference speeds.
contributor: Automotive Ontology Working Group
domainIncludes: Vehicle
isPartOf: auto.schema.org
rangeIncludes: QuantitativeValue

rangeIncludes
type: Property
comment: Relates a property to a class that constitutes (one of) the expected type(s) for values of the property.
domainIncludes: Property
isPartOf: meta.schema.org
rangeIncludes: Class

ticketedSeat
type: Property
comment: The seat associated with the ticket.
domainIncludes: Ticket
rangeIncludes: Seat

FulfillmentTypeDelivery
type: FulfillmentTypeEnumeration
comment: Fulfillment to a customer selected address.
isPartOf: pending.schema.org
source: https://github.com/schemaorg/schemaorg/issues/3617

gamePlatform
type: Property
comment: The electronic systems used to play video games.
domainIncludes: VideoGameSeries
domainIncludes: VideoGame
rangeIncludes: Text
rangeIncludes: URL
rangeIncludes: Thing

signDetected
type: Property
comment: A sign detected by the test.
domainIncludes: MedicalTest
isPartOf: health-lifesci.schema.org
rangeIncludes: MedicalSign

vehicleInteriorType
type: Property
comment: The type or material of the interior of the vehicle (e.g. synthetic fabric, leather, wood, etc.). While most interior types are characterized by the material used, an interior type can also be based on vehicle usage or target audience.
contributor: Automotive Ontology Working Group
domainIncludes: Vehicle
rangeIncludes: Text

annualPercentageRate
type: Property
comment: The annual rate that is charged for borrowing (or made by investing), expressed as a single percentage number that represents the actual yearly cost of funds over the term of a loan. This includes any fees or additional costs associated with the transaction.
contributor: FIBO
domainIncludes: FinancialProduct
rangeIncludes: QuantitativeValue
rangeIncludes: Number

makesOffer
type: Property
equivalent property: offers
comment: A pointer to products or services offered by the organization or person.
contributor: GoodRelationsTerms
domainIncludes: Organization
domainIncludes: Person
inverseOf: offeredBy
rangeIncludes: Offer

ReducedRelevanceForChildrenConsideration
type: AdultOrientedEnumeration
comment: A general code for cases where relevance to children is reduced, e.g. adult education, mortgages, retirement-related products, etc.
isPartOf: pending.schema.org
source: https://github.com/schemaorg/schemaorg/issues/2989

PaymentPastDue
type: PaymentStatusType
comment: The payment is due and considered late.

embeddedTextCaption
type: Property
comment: Represents textual captioning from a MediaObject, e.g. text of a 'meme'.
sub property of: caption
domainIncludes: ImageObject
domainIncludes: VideoObject
domainIncludes: AudioObject
isPartOf: pending.schema.org
rangeIncludes: Text
source: https://github.com/schemaorg/schemaorg/issues/2450

owner
type: Property
comment: A person or organization who owns this Thing.
domainIncludes: Thing
inverseOf: owns
rangeIncludes: Organization
rangeIncludes: Person
source: https://github.com/schemaorg/schemaorg/issues/4603

Discontinued
type: ItemAvailability
comment: Indicates that the item has been discontinued.

bitrate
type: Property
comment: The bitrate of the media object.
domainIncludes: MediaObject
rangeIncludes: Text

givenName
type: Property
comment: Given name. In the U.S., the first name of a Person.
domainIncludes: Person
rangeIncludes: Text

molecularWeight
type: Property
comment: This is the molecular weight of the entity being described, not of the parent. Units should be included in the form '<Number> <unit>', for example '12 amu' or as '<QuantitativeValue>.
domainIncludes: MolecularEntity
isPartOf: pending.schema.org
rangeIncludes: QuantitativeValue
rangeIncludes: Text
source: MolecularEntity

Nonprofit501c10
type: USNonprofitType
comment: Nonprofit501c10: Non-profit type referring to Domestic Fraternal Societies and Associations.
isPartOf: pending.schema.org
source: https://github.com/schemaorg/schemaorg/issues/2543

maximumAttendeeCapacity
type: Property
comment: The total number of individuals that may attend an event or venue.
sub property of: hasUpperBound
domainIncludes: Event
domainIncludes: Place
rangeIncludes: Integer

description
type: Property
equivalent property: description
comment: A description of the item.
domainIncludes: Thing
rangeIncludes: TextObject
rangeIncludes: Text

checkoutPageURLTemplate
type: Property
comment: A URL template (RFC 6570) for a checkout page for an offer. This approach allows merchants to specify a URL for online checkout of the offered product, by interpolating parameters such as the logged in user ID, product ID, quantity, discount code etc. Parameter naming and standardization are not specified here.
domainIncludes: Offer
isPartOf: pending.schema.org
rangeIncludes: Text
source: https://github.com/schemaorg/schemaorg/issues/3135

CompoundPriceSpecification
type: Class
comment: A compound price specification is one that bundles multiple prices that all apply in combination for different dimensions of consumption. Use the name property of the attached unit price specification for indicating the dimension of a price component (e.g. "electricity" or "final cleaning").
subclass of: PriceSpecification
contributor: good-relations-and-schema-org

originalMediaContextDescription
type: Property
comment: Describes, in a MediaReview when dealing with DecontextualizedContent, background information that can contribute to better interpretation of the MediaObject.
sub property of: description
domainIncludes: MediaReview
isPartOf: pending.schema.org
rangeIncludes: Text
source: https://github.com/schemaorg/schemaorg/issues/2450

MusicStore
type: Class
comment: A music store.
subclass of: Store

restockingFee
type: Property
comment: Use MonetaryAmount to specify a fixed restocking fee for product returns, or use Number to specify a percentage of the product price paid by the customer.
domainIncludes: MerchantReturnPolicy
domainIncludes: MerchantReturnPolicySeasonalOverride
isPartOf: pending.schema.org
rangeIncludes: Number
rangeIncludes: MonetaryAmount
source: https://github.com/schemaorg/schemaorg/issues/2880

CompletedActionStatus
type: ActionStatusType
comment: An action that has already taken place.

AudioObjectSnapshot
type: Class
comment: A specific and exact (byte-for-byte) version of an AudioObject. Two byte-for-byte identical files, for the purposes of this type, considered identical. If they have different embedded metadata the files will differ. Different external facts about the files, e.g. creator or dateCreated that aren't represented in their actual content, do not affect this notion of identity.
subclass of: AudioObject
isPartOf: pending.schema.org
source: https://github.com/schemaorg/schemaorg/issues/2450

FDAcategoryD
type: DrugPregnancyCategory
comment: A designation by the US FDA signifying that there is positive evidence of human fetal risk based on adverse reaction data from investigational or marketing experience or studies in humans, but potential benefits may warrant use of the drug in pregnant women despite potential risks.
isPartOf: health-lifesci.schema.org

BusinessAudience
type: Class
comment: A set of characteristics belonging to businesses, e.g. who compose an item's target audience.
subclass of: Audience

BoatTrip
type: Class
comment: A trip on a commercial ferry line.
subclass of: Trip
isPartOf: pending.schema.org
source: https://github.com/schemaorg/schemaorg/issues/1755

Question
type: Class
comment: A specific question - e.g. from a user seeking answers online, or collected in a Frequently Asked Questions (FAQ) document.
subclass of: Comment
contributor: QAStackExchange

billingStart
type: Property
comment: Specifies after how much time this price (or price component) becomes valid and billing starts. Can be used, for example, to model a price increase after the first year of a subscription. The unit of measurement is specified by the unitCode property.
domainIncludes: UnitPriceSpecification
isPartOf: pending.schema.org
rangeIncludes: Number
source: https://github.com/schemaorg/schemaorg/issues/2689

displayLocation
type: Property
comment: The location at which an item can be viewed or experienced in-person.
domainIncludes: CreativeWork
domainIncludes: Product
isPartOf: pending.schema.org
rangeIncludes: Place
source: https://github.com/schemaorg/schemaorg/issues/4513

Pharmacy
type: Class
comment: A pharmacy or drugstore.
subclass of: MedicalBusiness
subclass of: MedicalOrganization

releaseOf
type: Property
comment: The album this is a release of.
contributor: MBZ
domainIncludes: MusicRelease
inverseOf: albumRelease
rangeIncludes: MusicAlbum

TierBenefitEnumeration
type: Class
comment: An enumeration of possible benefits as part of a loyalty (members) program.
subclass of: Enumeration
isPartOf: pending.schema.org
source: https://github.com/schemaorg/schemaorg/issues/3563

Flexibility
type: PhysicalActivityCategory
comment: Physical activity that is engaged in to improve joint and muscle flexibility.
isPartOf: health-lifesci.schema.org

UserTweets
type: Class
comment: UserInteraction and its subtypes is an old way of talking about users interacting with pages. It is generally better to use Action-based vocabulary, alongside types such as Comment.
subclass of: UserInteraction
supersededBy: InteractionCounter

produces
type: Property
comment: The tangible thing generated by the service, e.g. a passport, permit, etc.
domainIncludes: Service
rangeIncludes: Thing
supersededBy: serviceOutput

itinerary
type: Property
comment: Destination(s) ( Place ) that make up a trip. For a trip where destination order is important use ItemList to specify that order (see examples).
contributor: Tourism
domainIncludes: Trip
isPartOf: pending.schema.org
rangeIncludes: Place
rangeIncludes: ItemList
source: https://github.com/schemaorg/schemaorg/issues/1810

expires
type: Property
comment: Date the content expires and is no longer useful or available. For example a VideoObject or NewsArticle whose availability or relevance is time-limited, a ClaimReview fact check whose publisher wants to indicate that it may no longer be relevant (or helpful to highlight) after some date, or a Certification the validity has expired.
domainIncludes: Certification
domainIncludes: CreativeWork
rangeIncludes: Date
rangeIncludes: DateTime

validUntil
type: Property
comment: The date when the item is no longer valid.
domainIncludes: Permit
rangeIncludes: Date

nsn
type: Property
equivalent property: nSNId
comment: Indicates the [NATO stock number](https://en.wikipedia.org/wiki/NATO_Stock_Number) (nsn) of a Product.
sub property of: identifier
sub property of: identifiedBy
domainIncludes: Product
isPartOf: pending.schema.org
rangeIncludes: Text
source: https://github.com/schemaorg/schemaorg/issues/2126

sharedContent
type: Property
comment: A CreativeWork such as an image, video, or audio clip shared as part of this posting.
domainIncludes: Comment
domainIncludes: SocialMediaPosting
rangeIncludes: CreativeWork

doseUnit
type: Property
comment: The unit of the dose, e.g. 'mg'.
domainIncludes: DoseSchedule
isPartOf: health-lifesci.schema.org
rangeIncludes: Text

MusicVideoObject
type: Class
comment: A music video file.
subclass of: MediaObject

members
type: Property
comment: A member of this organization.
domainIncludes: ProgramMembership
domainIncludes: Organization
rangeIncludes: Person
rangeIncludes: Organization
supersededBy: member

UsageOrScheduleHealthAspect
type: HealthAspectEnumeration
comment: Content about how, when, frequency and dosage of a topic.
isPartOf: pending.schema.org
source: https://github.com/schemaorg/schemaorg/issues/2374

actionPlatform
type: Property
comment: The high level platform(s) where the Action can be performed for the given URL. To specify a specific application or operating system instance, use actionApplication.
domainIncludes: EntryPoint
rangeIncludes: Text
rangeIncludes: URL
rangeIncludes: DigitalPlatformEnumeration

iupacName
type: Property
comment: Systematic method of naming chemical compounds as recommended by the International Union of Pure and Applied Chemistry (IUPAC).
domainIncludes: MolecularEntity
isPartOf: pending.schema.org
rangeIncludes: Text
source: MolecularEntity

EntryPoint
type: Class
comment: An entry point, within some Web-based protocol.
subclass of: Intangible
contributor: ActionCollabClass

legislationJurisdiction
type: Property
equivalent property: jurisdiction
comment: The jurisdiction from which the legislation originates.
sub property of: jurisdiction
sub property of: spatialCoverage
contributor: ELI
domainIncludes: Legislation
isPartOf: pending.schema.org
rangeIncludes: AdministrativeArea
rangeIncludes: Text
source: eli
source: https://github.com/schemaorg/schemaorg/issues/1156

countryOfOrigin
type: Property
equivalent property: originCountry
comment: The country of origin of something, including products as well as creative works such as movie and TV content. In the case of TV and movie, this would be the country of the principle offices of the production company or individual responsible for the movie. For other kinds of CreativeWork it is difficult to provide fully general guidance, and properties such as contentLocation and locationCreated may be more applicable. In the case of products, the country of origin of the product. The exact interpretation of this may vary by context and product type, and cannot be fully enumerated here.
domainIncludes: CreativeWork
domainIncludes: Product
domainIncludes: TVSeries
domainIncludes: TVEpisode
domainIncludes: Movie
domainIncludes: TVSeason
rangeIncludes: Country

Nonprofit501c19
type: USNonprofitType
comment: Nonprofit501c19: Non-profit type referring to Post or Organization of Past or Present Members of the Armed Forces.
isPartOf: pending.schema.org
source: https://github.com/schemaorg/schemaorg/issues/2543

IOSPlatform
type: DigitalPlatformEnumeration
comment: Represents the broad notion of iOS-based operating systems.
isPartOf: pending.schema.org
source: https://github.com/schemaorg/schemaorg/issues/3057

programmingLanguage
type: Property
comment: The computer programming language.
domainIncludes: SoftwareSourceCode
rangeIncludes: Text
rangeIncludes: ComputerLanguage

UnemploymentSupport
type: GovernmentBenefitsType
comment: UnemploymentSupport: this is a benefit for unemployment support.
isPartOf: pending.schema.org
source: https://github.com/schemaorg/schemaorg/issues/2534

scheduledPaymentDate
type: Property
comment: The date the invoice is scheduled to be paid.
domainIncludes: Invoice
rangeIncludes: Date

ExhibitionEvent
type: Class
comment: Event type: Exhibition event, e.g. at a museum, library, archive, tradeshow, ...
subclass of: Event

FailedActionStatus
type: ActionStatusType
comment: An action that failed to complete. The action's error property and the HTTP return code contain more information about the failure.

box
type: Property
comment: A box is the area enclosed by the rectangle formed by two points. The first point is the lower corner, the second point is the upper corner. A box is expressed as two points separated by a space character.
domainIncludes: GeoShape
rangeIncludes: Text

employee
type: Property
comment: Someone working for this organization.
domainIncludes: Organization
rangeIncludes: Person

citation
type: Property
comment: A citation or reference to another creative work, such as another publication, web page, scholarly article, etc.
domainIncludes: CreativeWork
rangeIncludes: CreativeWork
rangeIncludes: Text

unsaturatedFatContent
type: Property
comment: The number of grams of unsaturated fat.
domainIncludes: NutritionInformation
rangeIncludes: Mass

Nonprofit501c13
type: USNonprofitType
comment: Nonprofit501c13: Non-profit type referring to Cemetery Companies.
isPartOf: pending.schema.org
source: https://github.com/schemaorg/schemaorg/issues/2543

DataType
type: Class
comment: The basic data types such as Integers, Strings, etc.
subclass of: Class

hasPart
type: Property
comment: Indicates an item or CreativeWork that is part of this item, or CreativeWork (in some sense).
contributor: bibex
domainIncludes: CreativeWork
inverseOf: isPartOf
rangeIncludes: CreativeWork

FloorPlan
type: Class
comment: A FloorPlan is an explicit representation of a collection of similar accommodations, allowing the provision of common information (room counts, sizes, layout diagrams) and offers for rental or sale. In typical use, some ApartmentComplex has an accommodationFloorPlan which is a FloorPlan. A FloorPlan is always in the context of a particular place, either a larger ApartmentComplex or a single Apartment. The visual/spatial aspects of a floor plan (i.e. room layout, [see wikipedia](https://en.wikipedia.org/wiki/Floor_plan)) can be indicated using image.
subclass of: Intangible
isPartOf: pending.schema.org
source: https://github.com/schemaorg/schemaorg/issues/2373

IceCreamShop
type: Class
comment: An ice cream shop.
subclass of: FoodEstablishment

containsSeason
type: Property
comment: A season that is part of the media series.
sub property of: hasPart
domainIncludes: VideoGameSeries
domainIncludes: RadioSeries
domainIncludes: TVSeries
rangeIncludes: CreativeWorkSeason

SportsClub
type: Class
comment: A sports club.
subclass of: SportsActivityLocation

inventoryLevel
type: Property
comment: The current approximate inventory level for the item or items.
contributor: GoodRelationsTerms
domainIncludes: Offer
domainIncludes: Demand
domainIncludes: SomeProducts
rangeIncludes: QuantitativeValue

Protein
type: Class
comment: Protein is here used in its widest possible definition, as classes of amino acid based molecules. Amyloid-beta Protein in human (UniProt P05067), eukaryota (e.g. an OrthoDB group) or even a single molecule that one can point to are all of type :Protein. A protein can thus be a subclass of another protein, e.g. :Protein as a UniProt record can have multiple isoforms inside it which would also be :Protein. They can be imagined, synthetic, hypothetical or naturally occurring.
subclass of: BioChemEntity
isPartOf: pending.schema.org
source: bioschemas.org

reviews
type: Property
comment: Review of the item.
domainIncludes: Offer
domainIncludes: Organization
domainIncludes: Place
domainIncludes: CreativeWork
domainIncludes: Product
rangeIncludes: Review
supersededBy: review

previousItem
type: Property
comment: A link to the ListItem that precedes the current one.
domainIncludes: ListItem
rangeIncludes: ListItem

backstory
type: Property
comment: For an Article, typically a NewsArticle, the backstory property provides a textual summary giving a brief explanation of why and how an article was created. In a journalistic setting this could include information about reporting process, methods, interviews, data sources, etc.
contributor: TP
domainIncludes: Article
isPartOf: pending.schema.org
rangeIncludes: CreativeWork
rangeIncludes: Text
source: https://github.com/schemaorg/schemaorg/issues/1688

PreventionHealthAspect
type: HealthAspectEnumeration
comment: Information about actions or measures that can be taken to avoid getting the topic or reaching a critical situation related to the topic.
isPartOf: pending.schema.org
source: https://github.com/schemaorg/schemaorg/issues/2374

workLocation
type: Property
comment: A contact location for a person's place of work.
sub property of: location
domainIncludes: Person
rangeIncludes: Place
rangeIncludes: ContactPoint

Urologic
type: MedicalSpecialty
comment: A specific branch of medical science that is concerned with the diagnosis and treatment of diseases pertaining to the urinary tract and the urogenital system.
isPartOf: health-lifesci.schema.org

postalCode
type: Property
equivalent property: postcodeCode
equivalent property: hasPostalCode
equivalent property: postalCode
comment: The postal code. For example, 94043.
domainIncludes: GeoCoordinates
domainIncludes: DefinedRegion
domainIncludes: PostalAddress
domainIncludes: GeoShape
rangeIncludes: Text
source: https://github.com/schemaorg/schemaorg/issues/2506

numberOfBeds
type: Property
comment: The quantity of the given bed type available in the HotelRoom, Suite, House, or Apartment.
contributor: STI Accommodation Ontology
domainIncludes: BedDetails
rangeIncludes: Number

hasMenu
type: Property
comment: Either the actual menu as a structured representation, as text, or a URL of the menu.
domainIncludes: FoodEstablishment
rangeIncludes: Menu
rangeIncludes: Text
rangeIncludes: URL

MeasurementMethodEnum
type: Class
comment: Enumeration(s) for use with measurementMethod.
subclass of: Enumeration
isPartOf: pending.schema.org
source: https://github.com/schemaorg/schemaorg/issues/2564

legislationConsolidates
type: Property
equivalent property: consolidates
comment: Indicates another legislation taken into account in this consolidated legislation (which is usually the product of an editorial process that revises the legislation). This property should be used multiple times to refer to both the original version or the previous consolidated version, and to the legislations making the change.
contributor: ELI
domainIncludes: Legislation
isPartOf: pending.schema.org
rangeIncludes: Legislation
source: eli
source: https://github.com/schemaorg/schemaorg/issues/1156

albumProductionType
type: Property
comment: Classification of the album by its type of content: soundtrack, live album, studio album, etc.
contributor: MBZ
domainIncludes: MusicAlbum
rangeIncludes: MusicAlbumProductionType

usesDevice
type: Property
comment: Device used to perform the test.
domainIncludes: MedicalTest
isPartOf: health-lifesci.schema.org
rangeIncludes: MedicalDevice

PET
type: MedicalImagingTechnique
comment: Positron emission tomography imaging.
isPartOf: health-lifesci.schema.org

servicePhone
type: Property
comment: The phone number to use to access the service.
sub property of: hasAddress
domainIncludes: ServiceChannel
rangeIncludes: ContactPoint

ViolenceConsideration
type: AdultOrientedEnumeration
comment: Item shows or promotes violence.
isPartOf: pending.schema.org
source: https://github.com/schemaorg/schemaorg/issues/2989

partySize
type: Property
comment: Number of people the reservation should accommodate.
domainIncludes: TaxiReservation
domainIncludes: FoodEstablishmentReservation
rangeIncludes: Integer
rangeIncludes: QuantitativeValue

AMRadioChannel
type: Class
comment: A radio channel that uses AM.
subclass of: RadioChannel
source: https://github.com/schemaorg/schemaorg/issues/1004

PhoneCarrierPayment
type: PaymentMethodType
comment: Payment by billing via the phone carrier.

ShippingService
type: Class
comment: ShippingService represents the criteria used to determine if and how an offer could be shipped to a customer.
subclass of: StructuredValue
isPartOf: pending.schema.org
source: https://github.com/schemaorg/schemaorg/issues/3617

videoQuality
type: Property
comment: The quality of the video.
domainIncludes: VideoObject
rangeIncludes: Text

WearAction
type: Class
comment: The act of dressing oneself in clothing.
subclass of: UseAction

legislationPassedBy
type: Property
equivalent property: passed by
comment: The person or organization that originally passed or made the law: typically parliament (for primary legislation) or government (for secondary legislation). This indicates the "legal author" of the law, as opposed to its physical author.
sub property of: creator
contributor: ELI
domainIncludes: Legislation
isPartOf: pending.schema.org
rangeIncludes: Organization
rangeIncludes: Person
source: https://github.com/schemaorg/schemaorg/issues/1156
source: eli

broadcastChannelId
type: Property
comment: The unique address by which the BroadcastService can be identified in a provider lineup. In US, this is typically a number.
domainIncludes: BroadcastChannel
rangeIncludes: Text

UnitPriceSpecification
type: Class
comment: The price asked for a given offer by the respective organization or person.
subclass of: PriceSpecification
contributor: good-relations-and-schema-org

spatial
type: Property
equivalent property: spatial
comment: The "spatial" property can be used in cases when more specific properties (e.g. locationCreated, spatialCoverage, contentLocation) are not known to be appropriate.
domainIncludes: CreativeWork
rangeIncludes: Place

BodyMeasurementNeck
type: BodyMeasurementTypeEnumeration
comment: Girth of neck. Used, for example, to fit shirts.
isPartOf: pending.schema.org
source: https://github.com/schemaorg/schemaorg/issues/2811

RadioBroadcastService
type: Class
comment: A delivery service through which radio content is provided via broadcast over the air or online.
subclass of: BroadcastService
isPartOf: pending.schema.org
source: https://github.com/schemaorg/schemaorg/issues/2109

documentation
type: Property
comment: Further documentation describing the Web API in more detail.
domainIncludes: WebAPI
isPartOf: pending.schema.org
rangeIncludes: URL
rangeIncludes: CreativeWork
source: https://github.com/schemaorg/schemaorg/issues/1423

starRating
type: Property
comment: An official rating for a lodging business or food establishment, e.g. from national associations or standards bodies. Use the author property to indicate the rating organization, e.g. as an Organization with name such as (e.g. HOTREC, DEHOGA, WHR, or Hotelstars).
contributor: STI Accommodation Ontology
domainIncludes: LodgingBusiness
domainIncludes: FoodEstablishment
rangeIncludes: Rating

OwnershipInfo
type: Class
comment: A structured value providing information about when a certain organization or person owned a certain product.
subclass of: StructuredValue
contributor: good-relations-and-schema-org

AlgorithmicMediaDigitalSource
type: IPTCDigitalSourceEnumeration
comment: Content coded as 'algorithmic media' using the IPTC digital source type vocabulary.
isPartOf: pending.schema.org
source: https://github.com/schemaorg/schemaorg/issues/3392

character
type: Property
comment: Fictional person connected with a creative work.
domainIncludes: CreativeWork
rangeIncludes: Person

referee
type: Property
comment: An official who watches a game or match closely to enforce the rules and arbitrate on matters arising from the play such as referees, umpires or judges. The name of the effective function can vary according to the sport.
domainIncludes: SportsEvent
rangeIncludes: Person

fatContent
type: Property
comment: The number of grams of fat.
domainIncludes: NutritionInformation
rangeIncludes: Mass

TipAction
type: Class
comment: The act of giving money voluntarily to a beneficiary in recognition of services rendered.
subclass of: TradeAction

DigitalArtDigitalSource
type: IPTCDigitalSourceEnumeration
comment: Content coded as 'digital art' using the IPTC digital source type vocabulary.
isPartOf: pending.schema.org
source: https://github.com/schemaorg/schemaorg/issues/3392

previousStartDate
type: Property
comment: Used in conjunction with eventStatus for rescheduled or cancelled events. This property contains the previously scheduled start date. For rescheduled events, the startDate property should be used for the newly scheduled start date. In the (rare) case of an event that has been postponed and rescheduled multiple times, this field may be repeated.
domainIncludes: Event
rangeIncludes: DateTime
rangeIncludes: Date

appliesToDeliveryMethod
type: Property
comment: The delivery method(s) to which the delivery charge or payment charge specification applies.
contributor: GoodRelationsTerms
domainIncludes: DeliveryChargeSpecification
domainIncludes: PaymentChargeSpecification
rangeIncludes: DeliveryMethod

VirtualLocation
type: Class
comment: An online or virtual location for attending events. For example, one may attend an online seminar or educational event. While a virtual location may be used as the location of an event, virtual locations should not be confused with physical locations in the real world.
subclass of: Intangible
isPartOf: pending.schema.org
source: https://github.com/schemaorg/schemaorg/issues/1842

materialExtent
type: Property
comment: The quantity of the materials being described or an expression of the physical space they occupy.
domainIncludes: CreativeWork
isPartOf: pending.schema.org
rangeIncludes: QuantitativeValue
rangeIncludes: Text
source: https://github.com/schemaorg/schemaorg/issues/1759

FulfillmentTypeEnumeration
type: Class
comment: A type of product fulfillment.
subclass of: Enumeration
isPartOf: pending.schema.org
source: https://github.com/schemaorg/schemaorg/issues/3617

connectedTo
type: Property
comment: Other anatomical structures to which this structure is connected.
domainIncludes: AnatomicalStructure
isPartOf: health-lifesci.schema.org
rangeIncludes: AnatomicalStructure

maxPrice
type: Property
comment: The highest price if the price is a range.
sub property of: hasMonetaryAmount
sub property of: hasUpperBound
contributor: GoodRelationsTerms
domainIncludes: PriceSpecification
rangeIncludes: Number

FDAcategoryB
type: DrugPregnancyCategory
comment: A designation by the US FDA signifying that animal reproduction studies have failed to demonstrate a risk to the fetus and there are no adequate and well-controlled studies in pregnant women.
isPartOf: health-lifesci.schema.org

fulfillmentType
type: Property
comment: Type of fulfillment applicable to the ShippingService.
domainIncludes: ShippingService
isPartOf: pending.schema.org
rangeIncludes: FulfillmentTypeEnumeration
source: https://github.com/schemaorg/schemaorg/issues/3617

BodyMeasurementFoot
type: BodyMeasurementTypeEnumeration
comment: Foot length (measured between end of the most prominent toe and the most prominent part of the heel). Used, for example, to measure socks.
isPartOf: pending.schema.org
source: https://github.com/schemaorg/schemaorg/issues/2811

trainNumber
type: Property
comment: The unique identifier for the train.
domainIncludes: TrainTrip
rangeIncludes: Text

Friday
type: DayOfWeek
comment: The day of the week between Thursday and Saturday.

wordCount
type: Property
comment: The number of words in the text of the CreativeWork such as an Article, Book, etc.
domainIncludes: CreativeWork
domainIncludes: Article
rangeIncludes: Integer

legislationDateOfApplicability
type: Property
equivalent property: date applicability
comment: The date at which the Legislation becomes applicable. This can sometimes be distinct from the date of entry into force : a text may come in force today, and state it will become applicable in 3 months.
contributor: ELI
domainIncludes: Legislation
isPartOf: pending.schema.org
rangeIncludes: Date
source: https://github.com/schemaorg/schemaorg/issues/2698
source: eli

Nonprofit501c17
type: USNonprofitType
comment: Nonprofit501c17: Non-profit type referring to Supplemental Unemployment Benefit Trusts.
isPartOf: pending.schema.org
source: https://github.com/schemaorg/schemaorg/issues/2543

Winery
type: Class
comment: A winery.
subclass of: FoodEstablishment

RegularPrice
type: PriceTypeEnumeration
comment: Represents the regular price of an offered product. This is usually the advertised price before a temporary sale. Once the sale period ends the advertised price will go back to the regular price.
isPartOf: pending.schema.org
source: https://github.com/schemaorg/schemaorg/issues/3583

FinancialProduct
type: Class
comment: A product provided to consumers and businesses by financial institutions such as banks, insurance companies, brokerage firms, consumer finance companies, and investment companies which comprise the financial services industry.
subclass of: Service
contributor: FIBO

durationOfWarranty
type: Property
comment: The duration of the warranty promise. Common unitCode values are ANN for year, MON for months, or DAY for days.
sub property of: duration
contributor: GoodRelationsTerms
domainIncludes: WarrantyPromise
rangeIncludes: QuantitativeValue

FDAnotEvaluated
type: DrugPregnancyCategory
comment: A designation that the drug in question has not been assigned a pregnancy category designation by the US FDA.
isPartOf: health-lifesci.schema.org

MusicRecording
type: Class
comment: A music recording (track), usually a single song.
subclass of: CreativeWork

meetsEmissionStandard
type: Property
comment: Indicates that the vehicle meets the respective emission standard.
contributor: Automotive Ontology Working Group
domainIncludes: Vehicle
isPartOf: auto.schema.org
rangeIncludes: Text
rangeIncludes: URL
rangeIncludes: QualitativeValue

SingleCenterTrial
type: MedicalTrialDesign
comment: A trial that takes place at a single center.
isPartOf: health-lifesci.schema.org

caption
type: Property
comment: The caption for this object. For downloadable machine formats (closed caption, subtitles etc.) use MediaObject and indicate the encodingFormat.
domainIncludes: AudioObject
domainIncludes: VideoObject
domainIncludes: ImageObject
rangeIncludes: Text
rangeIncludes: MediaObject

TelevisionStation
type: Class
comment: A television station.
subclass of: LocalBusiness

hasOccupation
type: Property
comment: The Person's occupation. For past professions, use Role for expressing dates.
domainIncludes: Person
rangeIncludes: Occupation
source: https://github.com/schemaorg/schemaorg/issues/1698

salaryUponCompletion
type: Property
comment: The expected salary upon completing the training.
domainIncludes: EducationalOccupationalProgram
isPartOf: pending.schema.org
rangeIncludes: MonetaryAmountDistribution
source: https://github.com/schemaorg/schemaorg/issues/2289

Play
type: Class
comment: A play is a form of literature, usually consisting of dialogue between characters, intended for theatrical performance rather than just reading. Note: A performance of a Play would be a TheaterEvent or BroadcastEvent - the *Play* being the workPerformed.
subclass of: CreativeWork
isPartOf: pending.schema.org
source: https://github.com/schemaorg/schemaorg/issues/1816

ReturnShippingFees
type: ReturnFeesEnumeration
comment: Specifies that the customer must pay the return shipping costs when returning a product.
isPartOf: pending.schema.org
source: https://github.com/schemaorg/schemaorg/issues/2288

Nonprofit501c8
type: USNonprofitType
comment: Nonprofit501c8: Non-profit type referring to Fraternal Beneficiary Societies and Associations.
isPartOf: pending.schema.org
source: https://github.com/schemaorg/schemaorg/issues/2543

audienceType
type: Property
comment: The target group associated with a given audience (e.g. veterans, car owners, musicians, etc.).
domainIncludes: Audience
rangeIncludes: Text

PlayGameAction
type: Class
comment: The act of playing a video game.
subclass of: ConsumeAction
isPartOf: pending.schema.org
source: https://github.com/schemaorg/schemaorg/issues/3058

courseWorkload
type: Property
comment: The amount of work expected of students taking the course, often provided as a figure per week or per month, and may be broken down by type. For example, "2 hours of lectures, 1 hour of lab work and 3 hours of independent study per week".
domainIncludes: CourseInstance
isPartOf: pending.schema.org
rangeIncludes: Text
source: https://github.com/schemaorg/schemaorg/issues/1909

Nonprofit501c4
type: USNonprofitType
comment: Nonprofit501c4: Non-profit type referring to Civic Leagues, Social Welfare Organizations, and Local Associations of Employees.
isPartOf: pending.schema.org
source: https://github.com/schemaorg/schemaorg/issues/2543

Accommodation
type: Class
comment: An accommodation is a place that can accommodate human beings, e.g. a hotel room, a camping pitch, or a meeting room. Many accommodations are for overnight stays, but this is not a mandatory requirement. For more specific types of accommodations not defined in schema.org, one can use additionalType with external vocabularies. See also the dedicated document on the use of schema.org for marking up hotels and other forms of accommodations.
subclass of: Place
contributor: STI Accommodation Ontology

EUEnergyEfficiencyCategoryA
type: EUEnergyEfficiencyEnumeration
comment: Represents EU Energy Efficiency Class A as defined in EU energy labeling regulations.
isPartOf: pending.schema.org
source: https://github.com/schemaorg/schemaorg/issues/2670

incentiveStatus
type: Property
comment: The status of the incentive (active, on hold, retired, etc.).
domainIncludes: FinancialIncentive
isPartOf: pending.schema.org
rangeIncludes: IncentiveStatus
source: https://github.com/schemaorg/schemaorg/issues/3572

Nonprofit501c21
type: USNonprofitType
comment: Nonprofit501c21: Non-profit type referring to Black Lung Benefit Trusts.
isPartOf: pending.schema.org
source: https://github.com/schemaorg/schemaorg/issues/2543

eligibleCustomerType
type: Property
comment: The type(s) of customers for which the given offer is valid.
contributor: GoodRelationsTerms
domainIncludes: Offer
domainIncludes: Demand
rangeIncludes: BusinessEntityType

inChIKey
type: Property
comment: InChIKey is a hashed version of the full InChI (using the SHA-256 algorithm).
sub property of: hasRepresentation
domainIncludes: MolecularEntity
isPartOf: pending.schema.org
rangeIncludes: Text
source: MolecularEntity

serialNumber
type: Property
equivalent property: SerialId
comment: The serial number or any alphanumeric identifier of a particular product. When attached to an offer, it is a shortcut for the serial number of the product included in the offer.
sub property of: identifier
contributor: GoodRelationsTerms
domainIncludes: Offer
domainIncludes: Demand
domainIncludes: IndividualProduct
rangeIncludes: Text

activeIngredient
type: Property
comment: An active ingredient, typically chemical compounds and/or biologic substances.
domainIncludes: Drug
domainIncludes: Substance
domainIncludes: DietarySupplement
domainIncludes: DrugStrength
isPartOf: health-lifesci.schema.org
rangeIncludes: Text

MedicalTestPanel
type: Class
comment: Any collection of tests commonly ordered together.
subclass of: MedicalTest
isPartOf: health-lifesci.schema.org

VideoObjectSnapshot
type: Class
comment: A specific and exact (byte-for-byte) version of a VideoObject. Two byte-for-byte identical files, for the purposes of this type, considered identical. If they have different embedded metadata the files will differ. Different external facts about the files, e.g. creator or dateCreated that aren't represented in their actual content, do not affect this notion of identity.
subclass of: VideoObject
isPartOf: pending.schema.org
source: https://github.com/schemaorg/schemaorg/issues/2450

ReturnMethodEnumeration
type: Class
comment: Enumerates several types of product return methods.
subclass of: Enumeration
isPartOf: pending.schema.org
source: https://github.com/schemaorg/schemaorg/issues/2880

BeautySalon
type: Class
comment: Beauty salon.
subclass of: HealthAndBeautyBusiness

expressedIn
type: Property
comment: Tissue, organ, biological sample, etc in which activity of this gene has been observed experimentally. For example brain, digestive system.
domainIncludes: Gene
isPartOf: pending.schema.org
rangeIncludes: AnatomicalSystem
rangeIncludes: DefinedTerm
rangeIncludes: BioChemEntity
rangeIncludes: AnatomicalStructure
source: Gene

speakable
type: Property
comment: Indicates sections of a Web page that are particularly 'speakable' in the sense of being highlighted as being especially appropriate for text-to-speech conversion. Other sections of a page may also be usefully spoken in particular circumstances; the 'speakable' property serves to indicate the parts most likely to be generally useful for speech. The *speakable* property can be repeated an arbitrary number of times, with three kinds of possible 'content-locator' values: 1.) *id-value* URL references - uses *id-value* of an element in the page being annotated. The simplest use of *speakable* has (potentially relative) URL values, referencing identified sections of the document concerned. 2.) CSS Selectors - addresses content in the annotated page, e.g. via class attribute. Use the cssSelector property. 3.) XPaths - addresses content via XPaths (assuming an XML view of the content). Use the xpath property. For more sophisticated markup of speakable sections beyond simple ID references, either CSS selectors or XPath expressions to pick out document section(s) as speakable. For this we define a supporting type, SpeakableSpecification which is defined to be a possible value of the *speakable* property.
domainIncludes: WebPage
domainIncludes: Article
rangeIncludes: URL
rangeIncludes: SpeakableSpecification
source: https://github.com/schemaorg/schemaorg/issues/1389

ShareAction
type: Class
comment: The act of distributing content to people for their amusement or edification.
subclass of: CommunicateAction

assesses
type: Property
comment: The item being described is intended to assess the competency or learning outcome defined by the referenced term.
domainIncludes: CreativeWork
domainIncludes: LearningResource
domainIncludes: EducationEvent
isPartOf: pending.schema.org
rangeIncludes: Text
rangeIncludes: DefinedTerm
source: https://github.com/schemaorg/schemaorg/issues/2427

resultReview
type: Property
comment: A sub property of result. The review that resulted in the performing of the action.
sub property of: result
domainIncludes: ReviewAction
rangeIncludes: Review

doesNotShip
type: Property
comment: Indicates when shipping to a particular shippingDestination is not available.
domainIncludes: ShippingRateSettings
domainIncludes: OfferShippingDetails
domainIncludes: ShippingConditions
rangeIncludes: Boolean
source: https://github.com/schemaorg/schemaorg/issues/2506
source: https://github.com/schemaorg/schemaorg/issues/3617

prescriptionStatus
type: Property
comment: Indicates the status of drug prescription, e.g. local catalogs classifications or whether the drug is available by prescription or over-the-counter, etc.
domainIncludes: Drug
isPartOf: health-lifesci.schema.org
rangeIncludes: Text
rangeIncludes: DrugPrescriptionStatus

Code
type: Class
comment: Computer programming source code. Example: Full (compile ready) solutions, code snippet samples, scripts, templates.
subclass of: CreativeWork
supersededBy: SoftwareSourceCode

IncentiveQualifiedExpenseTypeGoodsOrServices
type: IncentiveQualifiedExpenseType
comment: This incentive can apply to either goods or services (or both).
isPartOf: pending.schema.org
source: https://github.com/schemaorg/schemaorg/issues/3572

diet
type: Property
comment: A sub property of instrument. The diet used in this action.
sub property of: instrument
domainIncludes: ExerciseAction
isPartOf: health-lifesci.schema.org
rangeIncludes: Diet

applicationSuite
type: Property
comment: The name of the application suite to which the application belongs (e.g. Excel belongs to Office).
domainIncludes: SoftwareApplication
rangeIncludes: Text

WearableSizeGroupPlus
type: WearableSizeGroupEnumeration
comment: Size group "Plus" for wearables.
isPartOf: pending.schema.org
source: https://github.com/schemaorg/schemaorg/issues/2811

StoreCreditRefund
type: RefundTypeEnumeration
comment: Specifies that the customer receives a store credit as refund when returning a product.
isPartOf: pending.schema.org
source: https://github.com/schemaorg/schemaorg/issues/2288

WearableSizeSystemUS
type: WearableSizeSystemEnumeration
comment: United States size system for wearables.
isPartOf: pending.schema.org
source: https://github.com/schemaorg/schemaorg/issues/2811

isVariantOf
type: Property
comment: Indicates the kind of product that this is a variant of. In the case of ProductModel, this is a pointer (from a ProductModel) to a base product from which this product is a variant. It is safe to infer that the variant inherits all product features from the base model, unless defined locally. This is not transitive. In the case of a ProductGroup, the group description also serves as a template, representing a set of Products that vary on explicitly defined, specific dimensions only (so it defines both a set of variants, as well as which values distinguish amongst those variants). When used with ProductGroup, this property can apply to any Product included in the group.
sub property of: exemplifies
sub property of: broader
contributor: GoodRelationsTerms
domainIncludes: ProductModel
domainIncludes: Product
inverseOf: hasVariant
rangeIncludes: ProductModel
rangeIncludes: ProductGroup

TaxiVehicleUsage
type: CarUsageType
comment: Indicates the usage of the car as a taxi.
contributor: Automotive Ontology Working Group
isPartOf: auto.schema.org

specialCommitments
type: Property
comment: Any special commitments associated with this job posting. Valid entries include VeteranCommit, MilitarySpouseCommit, etc.
domainIncludes: JobPosting
rangeIncludes: Text

median
type: Property
comment: The median value.
domainIncludes: QuantitativeValueDistribution
rangeIncludes: Number
source: https://github.com/schemaorg/schemaorg/issues/1698

risks
type: Property
comment: Specific physiologic risks associated to the diet plan.
domainIncludes: Diet
isPartOf: health-lifesci.schema.org
rangeIncludes: Text

numberOfPreviousOwners
type: Property
comment: The number of owners of the vehicle, including the current one.\n\nTypical unit code(s): C62.
contributor: Automotive Ontology Working Group
domainIncludes: Vehicle
rangeIncludes: QuantitativeValue
rangeIncludes: Number

Service
type: Class
comment: A service provided by an organization, e.g. delivery service, print services, etc.
subclass of: Intangible

roleName
type: Property
comment: A role played, performed or filled by a person or organization. For example, the team of creators for a comic book might fill the roles named 'inker', 'penciller', and 'letterer'; or an athlete in a SportsTeam might play in the position named 'Quarterback'.
domainIncludes: Role
rangeIncludes: Text
rangeIncludes: URL

Courthouse
type: Class
comment: A courthouse.
subclass of: GovernmentBuilding

directApply
type: Property
comment: Indicates whether an url that is associated with a JobPosting enables direct application for the job, via the posting website. A job posting is considered to have directApply of True if an application process for the specified job can be directly initiated via the url(s) given (noting that e.g. multiple internet domains might nevertheless be involved at an implementation level). A value of False is appropriate if there is no clear path to applying directly online for the specified job, navigating directly from the JobPosting url(s) supplied.
domainIncludes: JobPosting
isPartOf: pending.schema.org
rangeIncludes: Boolean
source: https://github.com/schemaorg/schemaorg/issues/2907

dateVehicleFirstRegistered
type: Property
comment: The date of the first registration of the vehicle with the respective public authorities.
contributor: Automotive Ontology Working Group
domainIncludes: Vehicle
rangeIncludes: Date

arrivalTime
type: Property
comment: The expected arrival time.
domainIncludes: Trip
rangeIncludes: DateTime
rangeIncludes: Time

parentOrganization
type: Property
equivalent property: parentOrganization
comment: The larger organization that this organization is a subOrganization of, if any.
domainIncludes: Organization
inverseOf: subOrganization
rangeIncludes: Organization

creditText
type: Property
comment: Text that can be used to credit person(s) and/or organization(s) associated with a published Creative Work.
domainIncludes: CreativeWork
isPartOf: pending.schema.org
rangeIncludes: Text
source: https://github.com/schemaorg/schemaorg/issues/2659

TierBenefitLoyaltyShipping
type: TierBenefitEnumeration
comment: Benefit of the tier is a members-only shipping price or speed (for example free shipping or 1-day shipping).
isPartOf: pending.schema.org
source: https://github.com/schemaorg/schemaorg/issues/3563

commentText
type: Property
comment: The text of the UserComment.
domainIncludes: UserComments
rangeIncludes: Text

infectiousAgentClass
type: Property
comment: The class of infectious agent (bacteria, prion, etc.) that causes the disease.
domainIncludes: InfectiousDisease
isPartOf: health-lifesci.schema.org
rangeIncludes: InfectiousAgentClass

numberOfCredits
type: Property
comment: The number of credits or units awarded by a Course or required to complete an EducationalOccupationalProgram.
domainIncludes: Course
domainIncludes: EducationalOccupationalProgram
isPartOf: pending.schema.org
rangeIncludes: Integer
rangeIncludes: StructuredValue
source: https://github.com/schemaorg/schemaorg/issues/2419

UseAction
type: Class
comment: The act of applying an object to its intended purpose.
subclass of: ConsumeAction

actor
type: Property
comment: An actor (individual or a group), e.g. in TV, radio, movie, video games etc., or in an event. Actors can be associated with individual items or with a series, episode, clip.
domainIncludes: Event
domainIncludes: PodcastSeries
domainIncludes: VideoObject
domainIncludes: RadioSeries
domainIncludes: TVSeries
domainIncludes: VideoGame
domainIncludes: Clip
domainIncludes: Episode
domainIncludes: CreativeWorkSeason
domainIncludes: MovieSeries
domainIncludes: Movie
domainIncludes: VideoGameSeries
rangeIncludes: Person
rangeIncludes: PerformingGroup

subjectOf
type: Property
comment: A CreativeWork or Event about this Thing.
domainIncludes: Thing
inverseOf: about
rangeIncludes: Event
rangeIncludes: CreativeWork
source: https://github.com/schemaorg/schemaorg/issues/1670

hostingOrganization
type: Property
comment: The Organization (airline, travelers' club, retailer, etc.) the membership is made with or which offers the MemberProgram.
domainIncludes: ProgramMembership
domainIncludes: MemberProgram
rangeIncludes: Organization

GiveAction
type: Class
comment: The act of transferring ownership of an object to a destination. Reciprocal of TakeAction.\n\nRelated actions:\n\n* TakeAction: Reciprocal of GiveAction.\n* SendAction: Unlike SendAction, GiveAction implies that ownership is being transferred (e.g. I may send my laptop to you, but that doesn't mean I'm giving it to you).
subclass of: TransferAction

InsuranceAgency
type: Class
comment: An Insurance agency.
subclass of: FinancialService

Therapeutic
type: MedicalDevicePurpose
comment: A medical device used for therapeutic purposes.
isPartOf: health-lifesci.schema.org

SingleFamilyResidence
type: Class
comment: Residence type: Single-family home.
subclass of: House

encodingFormat
type: Property
comment: Media type typically expressed using a MIME format (see [IANA site](http://www.iana.org/assignments/media-types/media-types.xhtml) and [MDN reference](https://developer.mozilla.org/en-US/docs/Web/HTTP/Basics_of_HTTP/MIME_types)), e.g. application/zip for a SoftwareApplication binary, audio/mpeg for .mp3 etc. In cases where a CreativeWork has several media type representations, encoding can be used to indicate each MediaObject alongside particular encodingFormat information. Unregistered or niche encoding and file formats can be indicated instead via the most appropriate URL, e.g. defining Web page or a Wikipedia/Wikidata entry.
domainIncludes: MediaObject
domainIncludes: CreativeWork
rangeIncludes: Text
rangeIncludes: URL

ApplyAction
type: Class
comment: The act of registering to an organization/service without the guarantee to receive it.\n\nRelated actions:\n\n* RegisterAction: Unlike RegisterAction, ApplyAction has no guarantees that the application will be accepted.
subclass of: OrganizeAction

targetProduct
type: Property
comment: Target Operating System / Product to which the code applies. If applies to several versions, just the product name can be used.
domainIncludes: SoftwareSourceCode
rangeIncludes: SoftwareApplication

isInvolvedInBiologicalProcess
type: Property
comment: Biological process this BioChemEntity is involved in; please use PropertyValue if you want to include any evidence.
domainIncludes: BioChemEntity
isPartOf: pending.schema.org
rangeIncludes: PropertyValue
rangeIncludes: DefinedTerm
rangeIncludes: URL
source: BioChemEntity

deliveryLeadTime
type: Property
comment: The typical delay between the receipt of the order and the goods either leaving the warehouse or being prepared for pickup, in case the delivery method is on site pickup.
contributor: GoodRelationsTerms
domainIncludes: Demand
domainIncludes: Offer
rangeIncludes: QuantitativeValue

EmployerReview
type: Class
comment: An EmployerReview is a review of an Organization regarding its role as an employer, written by a current or former employee of that organization.
subclass of: Review
isPartOf: pending.schema.org
source: https://github.com/schemaorg/schemaorg/issues/1589

refundType
type: Property
comment: A refund type, from an enumerated list.
domainIncludes: MerchantReturnPolicy
domainIncludes: MerchantReturnPolicySeasonalOverride
isPartOf: pending.schema.org
rangeIncludes: RefundTypeEnumeration
source: https://github.com/schemaorg/schemaorg/issues/2288

GardenStore
type: Class
comment: A garden store.
subclass of: Store

MovieRentalStore
type: Class
comment: A movie rental store.
subclass of: Store

DeliveryEvent
type: Class
comment: An event involving the delivery of an item.
subclass of: Event

tripOrigin
type: Property
comment: The location of origin of the trip, prior to any destination(s).
domainIncludes: Trip
rangeIncludes: Place

url
type: Property
equivalent property: url
comment: URL of the item.
domainIncludes: Thing
rangeIncludes: URL

TrackAction
type: Class
comment: An agent tracks an object for updates.\n\nRelated actions:\n\n* FollowAction: Unlike FollowAction, TrackAction refers to the interest on the location of innanimates objects.\n* SubscribeAction: Unlike SubscribeAction, TrackAction refers to the interest on the location of innanimate objects.
subclass of: FindAction

Nonprofit501c12
type: USNonprofitType
comment: Nonprofit501c12: Non-profit type referring to Benevolent Life Insurance Associations, Mutual Ditch or Irrigation Companies, Mutual or Cooperative Telephone Companies.
isPartOf: pending.schema.org
source: https://github.com/schemaorg/schemaorg/issues/2543

Nonprofit501q
type: USNonprofitType
comment: Nonprofit501q: Non-profit type referring to Credit Counseling Organizations.
isPartOf: pending.schema.org
source: https://github.com/schemaorg/schemaorg/issues/2543

maximumIntake
type: Property
comment: Recommended intake of this supplement for a given population as defined by a specific recommending authority.
domainIncludes: DrugStrength
domainIncludes: Drug
domainIncludes: Substance
domainIncludes: DietarySupplement
isPartOf: health-lifesci.schema.org
rangeIncludes: MaximumDoseSchedule

taxonomicRange
type: Property
comment: The taxonomic grouping of the organism that expresses, encodes, or in some way related to the BioChemEntity.
domainIncludes: BioChemEntity
isPartOf: pending.schema.org
rangeIncludes: DefinedTerm
rangeIncludes: Text
rangeIncludes: URL
rangeIncludes: Taxon
source: www.bioschemas.org

ContactPage
type: Class
comment: Web page type: Contact page.
subclass of: WebPage

isLocatedInSubcellularLocation
type: Property
comment: Subcellular location where this BioChemEntity is located; please use PropertyValue if you want to include any evidence.
domainIncludes: BioChemEntity
isPartOf: pending.schema.org
rangeIncludes: DefinedTerm
rangeIncludes: URL
rangeIncludes: PropertyValue
source: BioChemEntity

CommentPermission
type: DigitalDocumentPermissionType
comment: Permission to add comments to the document.

advanceBookingRequirement
type: Property
comment: The amount of time that is required between accepting the offer and the actual usage of the resource or service.
contributor: GoodRelationsTerms
domainIncludes: Offer
domainIncludes: Demand
rangeIncludes: QuantitativeValue

occupationalCredentialAwarded
type: Property
comment: A description of the qualification, award, certificate, diploma or other occupational credential awarded as a consequence of successful completion of this course or program.
domainIncludes: Course
domainIncludes: EducationalOccupationalProgram
isPartOf: pending.schema.org
rangeIncludes: EducationalOccupationalCredential
rangeIncludes: Text
rangeIncludes: URL
source: https://github.com/schemaorg/schemaorg/issues/2289

referencesOrder
type: Property
comment: The Order(s) related to this Invoice. One or more Orders may be combined into a single Invoice.
domainIncludes: Invoice
rangeIncludes: Order

seeks
type: Property
comment: A pointer to products or services sought by the organization or person (demand).
contributor: GoodRelationsTerms
domainIncludes: Organization
domainIncludes: Person
rangeIncludes: Demand

readBy
type: Property
comment: A person who reads (performs) the audiobook.
sub property of: actor
domainIncludes: Audiobook
isPartOf: bib.schema.org
rangeIncludes: Person

healthPlanCostSharing
type: Property
comment: The costs to the patient for services under this network or formulary.
domainIncludes: HealthPlanNetwork
domainIncludes: HealthPlanFormulary
isPartOf: pending.schema.org
rangeIncludes: HealthPlanCostSharingSpecification
rangeIncludes: Boolean
source: https://github.com/schemaorg/schemaorg/issues/1062

House
type: Class
comment: A house is a building or structure that has the ability to be occupied for habitation by humans or other creatures (source: Wikipedia, the free encyclopedia, see http://en.wikipedia.org/wiki/House).
subclass of: Accommodation
contributor: STI Accommodation Ontology

GeoCircle
type: Class
comment: A GeoCircle is a GeoShape representing a circular geographic area. As it is a GeoShape it provides the simple textual property 'circle', but also allows the combination of postalCode alongside geoRadius. The center of the circle can be indicated via the 'geoMidpoint' property, or more approximately using 'address', 'postalCode'.
subclass of: GeoShape

size
type: Property
equivalent property: sizeDescription
comment: A standardized size of a product or creative work, specified either through a simple textual string (for example 'XL', '32Wx34L'), a QuantitativeValue with a unitCode, or a comprehensive and structured SizeSpecification; in other cases, the width, height, depth and weight properties may be more applicable.
domainIncludes: CreativeWork
domainIncludes: Product
isPartOf: pending.schema.org
rangeIncludes: DefinedTerm
rangeIncludes: QuantitativeValue
rangeIncludes: SizeSpecification
rangeIncludes: Text
source: https://github.com/schemaorg/schemaorg/issues/1797

ReadPermission
type: DigitalDocumentPermissionType
comment: Permission to read or view the document.

EvidenceLevelC
type: MedicalEvidenceLevel
comment: Only consensus opinion of experts, case studies, or standard-of-care.
isPartOf: health-lifesci.schema.org

PurchaseTypeUsedPurchase
type: PurchaseType
comment: This is a purchase of a used item.
isPartOf: pending.schema.org
source: https://github.com/schemaorg/schemaorg/issues/3572

IPTCDigitalSourceEnumeration
type: Class
comment: IPTC "Digital Source" codes for use with the digitalSourceType property, providing information about the source for a digital media object. In general these codes are not declared here to be mutually exclusive, although some combinations would be contradictory if applied simultaneously, or might be considered mutually incompatible by upstream maintainers of the definitions. See the IPTC documentation for detailed definitions of all terms.
subclass of: MediaEnumeration
isPartOf: pending.schema.org
source: https://github.com/schemaorg/schemaorg/issues/3392

inSupportOf
type: Property
comment: Qualification, candidature, degree, application that Thesis supports.
domainIncludes: Thesis
isPartOf: bib.schema.org
rangeIncludes: Text

mathExpression
type: Property
comment: A mathematical expression (e.g. 'x^2-3x=0') that may be solved for a specific variable, simplified, or transformed. This can take many formats, e.g. LaTeX, Ascii-Math, or math as you would write with a keyboard.
domainIncludes: MathSolver
isPartOf: pending.schema.org
rangeIncludes: Text
rangeIncludes: SolveMathAction
source: https://github.com/schemaorg/schemaorg/issues/2740

AutomotiveBusiness
type: Class
comment: Car repair, sales, or parts.
subclass of: LocalBusiness

contentLocation
type: Property
comment: The location depicted or described in the content. For example, the location in a photograph or painting.
domainIncludes: CreativeWork
rangeIncludes: Place

Audiobook
type: Class
comment: An audiobook.
subclass of: AudioObject
subclass of: Book
isPartOf: bib.schema.org

Game
type: Class
comment: The Game type represents things which are games. These are typically rule-governed recreational activities, e.g. role-playing games in which players assume the role of characters in a fictional setting.
subclass of: CreativeWork

trailerWeight
type: Property
comment: The permitted weight of a trailer attached to the vehicle.\n\nTypical unit code(s): KGM for kilogram, LBR for pound\n* Note 1: You can indicate additional information in the name of the QuantitativeValue node.\n* Note 2: You may also link to a QualitativeValue node that provides additional information using valueReference.\n* Note 3: Note that you can use minValue and maxValue to indicate ranges.
contributor: Automotive Ontology Working Group
domainIncludes: Vehicle
isPartOf: auto.schema.org
rangeIncludes: QuantitativeValue

additionalProperty
type: Property
comment: A property-value pair representing an additional characteristic of the entity, e.g. a product feature or another characteristic for which there is no matching property in schema.org.\n\nNote: Publishers should be aware that applications designed to use specific schema.org properties (e.g. https://schema.org/width, https://schema.org/color, https://schema.org/gtin13, ...) will typically expect such data to be provided using those properties, rather than using the generic property/value mechanism.
domainIncludes: MerchantReturnPolicy
domainIncludes: Product
domainIncludes: QualitativeValue
domainIncludes: Offer
domainIncludes: Place
domainIncludes: QuantitativeValue
rangeIncludes: PropertyValue

healthPlanNetworkTier
type: Property
comment: The tier(s) for this network.
domainIncludes: HealthPlanNetwork
isPartOf: pending.schema.org
rangeIncludes: Text
source: https://github.com/schemaorg/schemaorg/issues/1062

deliveryStatus
type: Property
comment: New entry added as the package passes through each leg of its journey (from shipment to final delivery).
domainIncludes: ParcelDelivery
rangeIncludes: DeliveryEvent

PriceSpecification
type: Class
equivalent class: Price
comment: A structured value representing a price or price range. Typically, only the subclasses of this type are used for markup. It is recommended to use MonetaryAmount to describe independent amounts of money such as a salary, credit card limits, etc.
subclass of: StructuredValue
contributor: good-relations-and-schema-org

parents
type: Property
comment: A parents of the person.
domainIncludes: Person
rangeIncludes: Person
supersededBy: parent

UserDownloads
type: Class
comment: UserInteraction and its subtypes is an old way of talking about users interacting with pages. It is generally better to use Action-based vocabulary, alongside types such as Comment.
subclass of: UserInteraction
supersededBy: InteractionCounter

holdingArchive
type: Property
comment: ArchiveOrganization that holds, keeps or maintains the ArchiveComponent.
domainIncludes: ArchiveComponent
inverseOf: archiveHeld
isPartOf: pending.schema.org
rangeIncludes: ArchiveOrganization
source: https://github.com/schemaorg/schemaorg/issues/1758

AlgorithmicallyEnhancedDigitalSource
type: IPTCDigitalSourceEnumeration
comment: Content coded as 'algorithmically enhanced' using the IPTC digital source type vocabulary.
isPartOf: pending.schema.org
source: https://github.com/schemaorg/schemaorg/issues/3392

travelBans
type: Property
comment: Information about travel bans, e.g. in the context of a pandemic.
domainIncludes: SpecialAnnouncement
isPartOf: pending.schema.org
rangeIncludes: URL
rangeIncludes: WebContent
source: https://github.com/schemaorg/schemaorg/issues/2490

HealthPlanCostSharingSpecification
type: Class
comment: A description of costs to the patient under a given network or formulary.
subclass of: Intangible
isPartOf: pending.schema.org
source: https://github.com/schemaorg/schemaorg/issues/1062

linkRelationship
type: Property
comment: Indicates the relationship type of a Web link.
domainIncludes: LinkRole
isPartOf: pending.schema.org
rangeIncludes: Text
source: https://github.com/schemaorg/schemaorg/issues/1045

numberOfFullBathrooms
type: Property
comment: Number of full bathrooms - The total number of full and ¾ bathrooms in an Accommodation. This corresponds to the [BathroomsFull field in RESO](https://ddwiki.reso.org/display/DDW17/BathroomsFull+Field).
domainIncludes: Accommodation
domainIncludes: FloorPlan
isPartOf: pending.schema.org
rangeIncludes: Number
source: https://github.com/schemaorg/schemaorg/issues/2373

includedInHealthInsurancePlan
type: Property
comment: The insurance plans that cover this drug.
domainIncludes: Drug
isPartOf: pending.schema.org
rangeIncludes: HealthInsurancePlan
source: https://github.com/schemaorg/schemaorg/issues/1062

healthPlanNetworkId
type: Property
comment: Name or unique ID of network. (Networks are often reused across different insurance plans.)
domainIncludes: MedicalOrganization
domainIncludes: HealthPlanNetwork
isPartOf: pending.schema.org
rangeIncludes: Text
source: https://github.com/schemaorg/schemaorg/issues/1062

result
type: Property
comment: The result produced in the action. E.g. John wrote *a book*.
domainIncludes: Action
rangeIncludes: Thing

InformAction
type: Class
comment: The act of notifying someone of information pertinent to them, with no expectation of a response.
subclass of: CommunicateAction

gettingTestedInfo
type: Property
comment: Information about getting tested (for a MedicalCondition), e.g. in the context of a pandemic.
domainIncludes: SpecialAnnouncement
isPartOf: pending.schema.org
rangeIncludes: URL
rangeIncludes: WebContent
source: https://github.com/schemaorg/schemaorg/issues/2490

GenderType
type: Class
comment: An enumeration of genders.
subclass of: Enumeration

OfficeEquipmentStore
type: Class
comment: An office equipment store.
subclass of: Store

Pediatric
type: MedicalSpecialty
comment: A specific branch of medical science that specializes in the care of infants, children and adolescents.
subclass of: MedicalBusiness
isPartOf: health-lifesci.schema.org

IncentiveTypeRebateOrSubsidy
type: IncentiveType
comment: An incentive that reduces the purchase/lease cost of the good/service in question.
isPartOf: pending.schema.org
source: https://github.com/schemaorg/schemaorg/issues/3572

WearableSizeSystemCN
type: WearableSizeSystemEnumeration
comment: Chinese size system for wearables.
isPartOf: pending.schema.org
source: https://github.com/schemaorg/schemaorg/issues/2811

SexualContentConsideration
type: AdultOrientedEnumeration
comment: The item contains sexually oriented content such as nudity, suggestive or explicit material, or related online services, or is intended to enhance sexual activity. Examples: Erotic videos or magazine, sexual enhancement devices, sex toys.
isPartOf: pending.schema.org
source: https://github.com/schemaorg/schemaorg/issues/2989

WebAPI
type: Class
comment: An application programming interface accessible over Web/Internet technologies.
subclass of: Service
isPartOf: pending.schema.org
source: https://github.com/schemaorg/schemaorg/issues/1423

EventPostponed
type: EventStatusType
comment: The event has been postponed and no new date has been set. The event's previousStartDate should be set.

byMonth
type: Property
comment: Defines the month(s) of the year on which a recurring Event takes place. Specified as an Integer between 1-12. January is 1.
domainIncludes: Schedule
isPartOf: pending.schema.org
rangeIncludes: Integer
source: https://github.com/schemaorg/schemaorg/issues/1457

chemicalRole
type: Property
comment: A role played by the BioChemEntity within a chemical context.
domainIncludes: MolecularEntity
domainIncludes: ChemicalSubstance
isPartOf: pending.schema.org
rangeIncludes: DefinedTerm
source: ChemicalSubstance

parent
type: Property
comment: A parent of this person.
domainIncludes: Person
rangeIncludes: Person

SpokenWordAlbum
type: MusicAlbumProductionType
comment: SpokenWordAlbum.
contributor: MBZ

DoubleBlindedTrial
type: MedicalTrialDesign
comment: A trial design in which neither the researcher nor the patient knows the details of the treatment the patient was randomly assigned to.
isPartOf: health-lifesci.schema.org

DanceGroup
type: Class
comment: A dance group—for example, the Alvin Ailey Dance Theater or Riverdance.
subclass of: PerformingGroup

interactivityType
type: Property
comment: The predominant mode of learning supported by the learning resource. Acceptable values are 'active', 'expositive', or 'mixed'.
domainIncludes: CreativeWork
rangeIncludes: Text

LifestyleModification
type: Class
comment: A process of care involving exercise, changes to diet, fitness routines, and other lifestyle changes aimed at improving a health condition.
subclass of: MedicalEntity
isPartOf: health-lifesci.schema.org

legislationCommences
type: Property
equivalent property: commences
comment: Another legislation that this one sets into force.
sub property of: legislationChanges
contributor: ELI
domainIncludes: Legislation
isPartOf: pending.schema.org
rangeIncludes: Legislation
source: https://github.com/schemaorg/schemaorg/issues/2698
source: eli

broadcastServiceTier
type: Property
comment: The type of service required to have access to the channel (e.g. Standard or Premium).
domainIncludes: BroadcastChannel
rangeIncludes: Text

byMonthDay
type: Property
comment: Defines the day(s) of the month on which a recurring Event takes place. Specified as an Integer between 1-31.
domainIncludes: Schedule
isPartOf: pending.schema.org
rangeIncludes: Integer
source: https://github.com/schemaorg/schemaorg/issues/1457

infectiousAgent
type: Property
comment: The actual infectious agent, such as a specific bacterium.
domainIncludes: InfectiousDisease
isPartOf: health-lifesci.schema.org
rangeIncludes: Text

width
type: Property
comment: The width of the item.
domainIncludes: VisualArtwork
domainIncludes: OfferShippingDetails
domainIncludes: ShippingConditions
domainIncludes: MediaObject
domainIncludes: Product
rangeIncludes: QuantitativeValue
rangeIncludes: Distance
source: https://github.com/schemaorg/schemaorg/issues/3617

HobbyShop
type: Class
comment: A store that sells materials useful or necessary for various hobbies.
subclass of: Store

exifData
type: Property
comment: exif data for this object.
domainIncludes: ImageObject
rangeIncludes: PropertyValue
rangeIncludes: Text

DesktopWebPlatform
type: DigitalPlatformEnumeration
comment: Represents the broad notion of 'desktop' browsers as a Web Platform.
isPartOf: pending.schema.org
source: https://github.com/schemaorg/schemaorg/issues/3057

Nonprofit501c16
type: USNonprofitType
comment: Nonprofit501c16: Non-profit type referring to Cooperative Organizations to Finance Crop Operations.
isPartOf: pending.schema.org
source: https://github.com/schemaorg/schemaorg/issues/2543

organizer
type: Property
comment: An organizer of an Event.
domainIncludes: Event
rangeIncludes: Organization
rangeIncludes: Person

validFor
type: Property
comment: The duration of validity of a permit or similar thing.
domainIncludes: Credential
domainIncludes: Permit
rangeIncludes: Duration
source: https://github.com/schemaorg/schemaorg/issues/1779

printEdition
type: Property
comment: The edition of the print product in which the NewsArticle appears.
domainIncludes: NewsArticle
rangeIncludes: Text

loanPaymentAmount
type: Property
comment: The amount of money to pay in a single payment.
contributor: FIBO
domainIncludes: RepaymentSpecification
isPartOf: pending.schema.org
rangeIncludes: MonetaryAmount
source: https://github.com/schemaorg/schemaorg/issues/1253

suggestedMeasurement
type: Property
comment: A suggested range of body measurements for the intended audience or person, for example inseam between 32 and 34 inches or height between 170 and 190 cm. Typically found on a size chart for wearable products.
domainIncludes: PeopleAudience
domainIncludes: SizeSpecification
isPartOf: pending.schema.org
rangeIncludes: QuantitativeValue
source: https://github.com/schemaorg/schemaorg/issues/2811

Genitourinary
type: PhysicalExam
comment: Genitourinary system function assessment with clinical examination.
isPartOf: health-lifesci.schema.org

PublicationEvent
type: Class
comment: A PublicationEvent corresponds indifferently to the event of publication for a CreativeWork of any type, e.g. a broadcast event, an on-demand event, a book/journal publication via a variety of delivery media.
subclass of: Event

valueReference
type: Property
comment: A secondary value that provides additional information on the original value, e.g. a reference temperature or a type of measurement.
contributor: GoodRelationsTerms
domainIncludes: QualitativeValue
domainIncludes: PropertyValue
domainIncludes: QuantitativeValue
rangeIncludes: StructuredValue
rangeIncludes: Text
rangeIncludes: QualitativeValue
rangeIncludes: PropertyValue
rangeIncludes: MeasurementTypeEnumeration
rangeIncludes: QuantitativeValue
rangeIncludes: DefinedTerm
rangeIncludes: Enumeration

paymentStatus
type: Property
comment: The status of payment; whether the invoice has been paid or not.
domainIncludes: Invoice
rangeIncludes: Text
rangeIncludes: PaymentStatusType

Nonprofit501k
type: USNonprofitType
comment: Nonprofit501k: Non-profit type referring to Child Care Organizations.
isPartOf: pending.schema.org
source: https://github.com/schemaorg/schemaorg/issues/2543

ResumeAction
type: Class
comment: The act of resuming a device or application which was formerly paused (e.g. resume music playback or resume a timer).
subclass of: ControlAction

issuedThrough
type: Property
comment: The service through which the permit was granted.
domainIncludes: Permit
rangeIncludes: Service

ChemicalSubstance
type: Class
comment: A chemical substance is 'a portion of matter of constant composition, composed of molecular entities of the same type or of different types' (source: [ChEBI:59999](https://www.ebi.ac.uk/chebi/searchId.do?chebiId=59999)).
subclass of: BioChemEntity
isPartOf: pending.schema.org
source: bioschemas.org
source: https://www.ebi.ac.uk/chebi/searchId.do

orderDelivery
type: Property
comment: The delivery of the parcel related to this order or order item.
domainIncludes: OrderItem
domainIncludes: Order
rangeIncludes: ParcelDelivery

estimatedCost
type: Property
comment: The estimated cost of the supply or supplies consumed when performing instructions.
domainIncludes: HowToSupply
domainIncludes: HowTo
rangeIncludes: Text
rangeIncludes: MonetaryAmount

GenericWebPlatform
type: DigitalPlatformEnumeration
comment: Represents the generic notion of the Web Platform. More specific codes include MobileWebPlatform and DesktopWebPlatform, as an incomplete list.
isPartOf: pending.schema.org
source: https://github.com/schemaorg/schemaorg/issues/3057

ToyStore
type: Class
comment: A toy store.
subclass of: Store

NutritionInformation
type: Class
comment: Nutritional information about the recipe.
subclass of: StructuredValue

Prion
type: InfectiousAgentClass
comment: A prion is an infectious agent composed of protein in a misfolded form.
isPartOf: health-lifesci.schema.org

State
type: Class
comment: A state or province of a country.
subclass of: AdministrativeArea

Nonprofit501c28
type: USNonprofitType
comment: Nonprofit501c28: Non-profit type referring to National Railroad Retirement Investment Trusts.
isPartOf: pending.schema.org
source: https://github.com/schemaorg/schemaorg/issues/2543

BedType
type: Class
comment: A type of bed. This is used for indicating the bed or beds available in an accommodation.
subclass of: QualitativeValue
contributor: STI Accommodation Ontology
source: https://github.com/schemaorg/schemaorg/issues/1262

GovernmentOrganization
type: Class
comment: A governmental organization or agency.
subclass of: Organization

Dermatologic
type: MedicalSpecialty
comment: Something relating to or practicing dermatology.
isPartOf: health-lifesci.schema.org
supersededBy: Dermatology

legislationRepeals
type: Property
equivalent property: repeals
comment: Another legislation that this legislation repeals (cancels, abrogates).
sub property of: legislationChanges
contributor: ELI
domainIncludes: Legislation
isPartOf: pending.schema.org
rangeIncludes: Legislation
source: https://github.com/schemaorg/schemaorg/issues/2698
source: eli

AdultOrientedEnumeration
type: Class
comment: Enumeration of considerations that make a product relevant or potentially restricted for adults only.
subclass of: Enumeration
isPartOf: pending.schema.org
source: https://github.com/schemaorg/schemaorg/issues/2989

Genetic
type: MedicalSpecialty
comment: A specific branch of medical science that pertains to hereditary transmission and the variation of inherited characteristics and disorders.
isPartOf: health-lifesci.schema.org

gender
type: Property
comment: Gender of something, typically a Person, but possibly also fictional characters, animals, etc. While https://schema.org/Male and https://schema.org/Female may be used, text strings are also acceptable for people who are not a binary gender. The gender property can also be used in an extended sense to cover e.g. the gender of sports teams. As with the gender of individuals, we do not try to enumerate all possibilities. A mixed-gender SportsTeam can be indicated with a text value of "Mixed".
domainIncludes: SportsTeam
domainIncludes: Person
isPartOf: pending.schema.org
rangeIncludes: Text
rangeIncludes: GenderType
source: https://github.com/schemaorg/schemaorg/issues/2341

postalCodeBegin
type: Property
comment: First postal code in a range (included).
sub property of: hasLowerBound
domainIncludes: PostalCodeRangeSpecification
rangeIncludes: Text
source: https://github.com/schemaorg/schemaorg/issues/2506

Consortium
type: Class
comment: A Consortium is a membership Organization whose members are typically Organizations.
subclass of: Organization
isPartOf: pending.schema.org
source: https://github.com/schemaorg/schemaorg/issues/1559

Diet
type: Class
comment: A strategy of regulating the intake of food to achieve or maintain a specific health-related goal.
subclass of: CreativeWork
subclass of: LifestyleModification
isPartOf: health-lifesci.schema.org

DrugPregnancyCategory
type: Class
comment: Categories that represent an assessment of the risk of fetal injury due to a drug or pharmaceutical used as directed by the mother during pregnancy.
subclass of: MedicalEnumeration
isPartOf: health-lifesci.schema.org

departureTime
type: Property
comment: The expected departure time.
domainIncludes: Trip
rangeIncludes: DateTime
rangeIncludes: Time

IndividualProduct
type: Class
disjoint with: ProductModel
equivalent class: SpecifiedTradeProduct
comment: A single, identifiable product instance (e.g. a laptop with a particular serial number).
subclass of: Product
contributor: good-relations-and-schema-org

ArchiveComponent
type: Class
comment: An intangible type to be applied to any archive content, carrying with it a set of properties required to describe archival items and collections.
subclass of: CreativeWork
isPartOf: pending.schema.org
source: https://github.com/schemaorg/schemaorg/issues/1758

xpath
type: Property
comment: An XPath, e.g. of a SpeakableSpecification or WebPageElement. In the latter case, multiple matches within a page can constitute a single conceptual "Web page element".
domainIncludes: WebPageElement
domainIncludes: SpeakableSpecification
rangeIncludes: XPathType
source: https://github.com/schemaorg/schemaorg/issues/1389

beforeMedia
type: Property
comment: A media object representing the circumstances before performing this direction.
domainIncludes: HowToDirection
rangeIncludes: MediaObject
rangeIncludes: URL

EventCancelled
type: EventStatusType
comment: The event has been cancelled. If the event has multiple startDate values, all are assumed to be cancelled. Either startDate or previousStartDate may be used to specify the event's cancelled date(s).

AddAction
type: Class
comment: The act of editing by adding an object to a collection.
subclass of: UpdateAction

ProductModel
type: Class
comment: A datasheet or vendor specification of a product (in the sense of a prototypical description).
subclass of: Product
contributor: good-relations-and-schema-org

partOfSeries
type: Property
comment: The series to which this episode or season belongs.
sub property of: isPartOf
domainIncludes: Clip
domainIncludes: Episode
domainIncludes: CreativeWorkSeason
rangeIncludes: CreativeWorkSeries

tracks
type: Property
comment: A music recording (track)—usually a single song.
domainIncludes: MusicGroup
domainIncludes: MusicPlaylist
rangeIncludes: MusicRecording
supersededBy: track

HVACBusiness
type: Class
comment: A business that provides Heating, Ventilation and Air Conditioning services.
subclass of: HomeAndConstructionBusiness

pagination
type: Property
equivalent property: pages
comment: Any description of pages that is not separated into pageStart and pageEnd; for example, "1-6, 9, 55" or "10-12, 46-49".
contributor: bibex
domainIncludes: PublicationIssue
domainIncludes: Chapter
domainIncludes: PublicationVolume
domainIncludes: Article
rangeIncludes: Text

USNonprofitType
type: Class
comment: USNonprofitType: Non-profit organization type originating from the United States.
subclass of: NonprofitType
isPartOf: pending.schema.org
source: https://github.com/schemaorg/schemaorg/issues/2543

releaseNotes
type: Property
comment: Description of what changed in this version.
domainIncludes: SoftwareApplication
rangeIncludes: Text
rangeIncludes: URL

SurgicalProcedure
type: Class
equivalent class: http://purl.bioontology.org/ontology/SNOMEDCT/387713003
comment: A medical procedure involving an incision with instruments; performed for diagnose, or therapeutic purposes.
subclass of: MedicalProcedure
isPartOf: health-lifesci.schema.org

HairSalon
type: Class
comment: A hair salon.
subclass of: HealthAndBeautyBusiness

WearableSizeGroupBoys
type: WearableSizeGroupEnumeration
comment: Size group "Boys" for wearables.
isPartOf: pending.schema.org
source: https://github.com/schemaorg/schemaorg/issues/2811

customerRemorseReturnFees
type: Property
comment: The type of return fees if the product is returned due to customer remorse.
domainIncludes: MerchantReturnPolicy
isPartOf: pending.schema.org
rangeIncludes: ReturnFeesEnumeration
source: https://github.com/schemaorg/schemaorg/issues/2880

Electrician
type: Class
comment: An electrician.
subclass of: HomeAndConstructionBusiness

partOfTVSeries
type: Property
comment: The TV series to which this episode or season belongs.
sub property of: isPartOf
domainIncludes: TVClip
domainIncludes: TVEpisode
domainIncludes: TVSeason
rangeIncludes: TVSeries
supersededBy: partOfSeries

sha256
type: Property
comment: The [SHA-2](https://en.wikipedia.org/wiki/SHA-2) SHA256 hash of the content of the item. For example, a zero-length input has value 'e3b0c44298fc1c149afbf4c8996fb92427ae41e4649b934ca495991b7852b855'.
sub property of: description
domainIncludes: MediaObject
isPartOf: pending.schema.org
rangeIncludes: Text
source: https://github.com/schemaorg/schemaorg/issues/2450

benefitsSummaryUrl
type: Property
comment: The URL that goes directly to the summary of benefits and coverage for the specific standard plan or plan variation.
domainIncludes: HealthInsurancePlan
isPartOf: pending.schema.org
rangeIncludes: URL
source: https://github.com/schemaorg/schemaorg/issues/1062

sportsEvent
type: Property
comment: A sub property of location. The sports event where this action occurred.
sub property of: location
domainIncludes: ExerciseAction
rangeIncludes: SportsEvent

amountOfThisGood
type: Property
comment: The quantity of the goods included in the offer.
contributor: GoodRelationsTerms
domainIncludes: TypeAndQuantityNode
rangeIncludes: Number

IncentiveTypeTaxWaiver
type: IncentiveType
comment: An incentive that reduces/exempts the recipient from taxation applicable to the incentivized good/service (e.g. luxury taxes, registration taxes, circulation tax).
isPartOf: pending.schema.org
source: https://github.com/schemaorg/schemaorg/issues/3572

DVDFormat
type: MusicReleaseFormatType
comment: DVDFormat.
contributor: MBZ

printPage
type: Property
comment: If this NewsArticle appears in print, this field indicates the name of the page on which the article is found. Please note that this field is intended for the exact page name (e.g. A5, B18).
domainIncludes: NewsArticle
rangeIncludes: Text

answerCount
type: Property
comment: The number of answers this question has received.
domainIncludes: Question
rangeIncludes: Integer

Bakery
type: Class
comment: A bakery.
subclass of: FoodEstablishment

typicalTest
type: Property
comment: A medical test typically performed given this condition.
domainIncludes: MedicalCondition
isPartOf: health-lifesci.schema.org
rangeIncludes: MedicalTest

vehicleTransmission
type: Property
comment: The type of component used for transmitting the power from a rotating power source to the wheels or other relevant component(s) ("gearbox" for cars).
contributor: Automotive Ontology Working Group
domainIncludes: Vehicle
rangeIncludes: Text
rangeIncludes: URL
rangeIncludes: QualitativeValue

ParkingFacility
type: Class
comment: A parking lot or other parking facility.
subclass of: CivicStructure

Patient
type: Class
equivalent class: http://purl.bioontology.org/ontology/SNOMEDCT/116154003
comment: A patient is any person recipient of health care services.
subclass of: MedicalAudience
subclass of: Person
isPartOf: health-lifesci.schema.org

hasEnergyEfficiencyCategory
type: Property
comment: Defines the energy efficiency Category (which could be either a rating out of range of values or a yes/no certification) for a product according to an international energy efficiency standard.
domainIncludes: EnergyConsumptionDetails
isPartOf: pending.schema.org
rangeIncludes: EnergyEfficiencyEnumeration
source: https://github.com/schemaorg/schemaorg/issues/2670

Nose
type: PhysicalExam
comment: Nose function assessment with clinical examination.
isPartOf: health-lifesci.schema.org

MedicalCondition
type: Class
comment: Any condition of the human body that affects the normal functioning of a person, whether physically or mentally. Includes diseases, injuries, disabilities, disorders, syndromes, etc.
subclass of: MedicalEntity
isPartOf: health-lifesci.schema.org

UKNonprofitType
type: Class
comment: UKNonprofitType: Non-profit organization type originating from the United Kingdom.
subclass of: NonprofitType
isPartOf: pending.schema.org
source: https://github.com/schemaorg/schemaorg/issues/2543

tissueSample
type: Property
comment: The type of tissue sample required for the test.
domainIncludes: PathologyTest
isPartOf: health-lifesci.schema.org
rangeIncludes: Text

Toxicologic
type: MedicalSpecialty
comment: A specific branch of medical science that is concerned with poisons, their nature, effects and detection and involved in the treatment of poisoning.
isPartOf: health-lifesci.schema.org

OccupationalExperienceRequirements
type: Class
comment: Indicates employment-related experience requirements, e.g. monthsOfExperience.
subclass of: Intangible
isPartOf: pending.schema.org
source: https://github.com/schemaorg/schemaorg/issues/2681

healthcareReportingData
type: Property
comment: Indicates data describing a hospital, e.g. a CDC CDCPMDRecord or as some kind of Dataset.
domainIncludes: Hospital
isPartOf: pending.schema.org
rangeIncludes: CDCPMDRecord
rangeIncludes: Dataset
source: https://github.com/schemaorg/schemaorg/issues/2521

alumni
type: Property
comment: Alumni of an organization.
domainIncludes: Organization
domainIncludes: EducationalOrganization
inverseOf: alumniOf
rangeIncludes: Person

procedure
type: Property
comment: A description of the procedure involved in setting up, using, and/or installing the device.
domainIncludes: MedicalDevice
isPartOf: health-lifesci.schema.org
rangeIncludes: Text

BookStore
type: Class
comment: A bookstore.
subclass of: Store

programName
type: Property
comment: The program providing the membership. It is preferable to use [:program](https://schema.org/program) instead.
domainIncludes: ProgramMembership
rangeIncludes: Text

Thing
type: Class
comment: The most generic type of item.

ShoeStore
type: Class
comment: A shoe store.
subclass of: Store

WearableSizeSystemUK
type: WearableSizeSystemEnumeration
comment: United Kingdom size system for wearables.
isPartOf: pending.schema.org
source: https://github.com/schemaorg/schemaorg/issues/2811

mediaAuthenticityCategory
type: Property
comment: Indicates a MediaManipulationRatingEnumeration classification of a media object (in the context of how it was published or shared).
domainIncludes: MediaReview
isPartOf: pending.schema.org
rangeIncludes: MediaManipulationRatingEnumeration
source: https://github.com/schemaorg/schemaorg/issues/2450

coverageEndTime
type: Property
comment: The time when the live blog will stop covering the Event. Note that coverage may continue after the Event concludes.
domainIncludes: LiveBlogPosting
rangeIncludes: DateTime

MedicalSpecialty
type: Class
comment: Any specific branch of medical science or practice. Medical specialities include clinical specialties that pertain to particular organ systems and their respective disease states, as well as allied health specialties. Enumerated type.
subclass of: MedicalEnumeration
subclass of: Specialty
isPartOf: health-lifesci.schema.org

SaleEvent
type: Class
comment: Event type: Sales event.
subclass of: Event

ItemListOrderAscending
type: ItemListOrderType
comment: An ItemList ordered with lower values listed first.

ExerciseGym
type: Class
comment: A gym.
subclass of: SportsActivityLocation

OrderAction
type: Class
comment: An agent orders an object/product/service to be delivered/sent.
subclass of: TradeAction

InfectiousDisease
type: Class
comment: An infectious disease is a clinically evident human disease resulting from the presence of pathogenic microbial agents, like pathogenic viruses, pathogenic bacteria, fungi, protozoa, multicellular parasites, and prions. To be considered an infectious disease, such pathogens are known to be able to cause this disease.
subclass of: MedicalCondition
isPartOf: health-lifesci.schema.org

homeLocation
type: Property
comment: A contact location for a person's residence.
sub property of: location
domainIncludes: Person
rangeIncludes: Place
rangeIncludes: ContactPoint

UserCheckins
type: Class
comment: UserInteraction and its subtypes is an old way of talking about users interacting with pages. It is generally better to use Action-based vocabulary, alongside types such as Comment.
subclass of: UserInteraction
supersededBy: InteractionCounter

alignmentType
type: Property
comment: A category of alignment between the learning resource and the framework node. Recommended values include: 'requires', 'textComplexity', 'readingLevel', and 'educationalSubject'.
domainIncludes: AlignmentObject
rangeIncludes: Text

AudioObject
type: Class
comment: An audio file.
subclass of: MediaObject
contributor: rNews

certificationIdentification
type: Property
equivalent property: CertificateIdentifier
comment: Identifier of a certification instance (as registered with an independent certification body). Typically this identifier can be used to consult and verify the certification instance. See also [gs1:certificationIdentification](https://www.gs1.org/voc/certificationIdentification).
sub property of: hasRegistrationIdentifier
domainIncludes: Certification
isPartOf: pending.schema.org
rangeIncludes: Text
rangeIncludes: DefinedTerm
source: https://github.com/schemaorg/schemaorg/issues/3230

BioChemEntity
type: Class
comment: Any biological, chemical, or biochemical thing. For example: a protein; a gene; a chemical; a synthetic chemical.
subclass of: Thing
isPartOf: pending.schema.org
source: bioschemas.org

program
type: Property
comment: The [MemberProgram](https://schema.org/MemberProgram) associated with a [ProgramMembership](https://schema.org/ProgramMembership).
domainIncludes: ProgramMembership
rangeIncludes: MemberProgram
source: https://github.com/schemaorg/schemaorg/issues/3563

itemCondition
type: Property
comment: A predefined value from OfferItemCondition specifying the condition of the product or service, or the products or services included in the offer. Also used for product return policies to specify the condition of products accepted for returns.
domainIncludes: Offer
domainIncludes: Demand
domainIncludes: MerchantReturnPolicy
domainIncludes: Product
rangeIncludes: OfferItemCondition

fiberContent
type: Property
comment: The number of grams of fiber.
domainIncludes: NutritionInformation
rangeIncludes: Mass

WearableSizeGroupMaternity
type: WearableSizeGroupEnumeration
comment: Size group "Maternity" for wearables.
isPartOf: pending.schema.org
source: https://github.com/schemaorg/schemaorg/issues/2811

ShippingRateSettings
type: Class
comment: A ShippingRateSettings represents re-usable pieces of shipping information. It is designed for publication on an URL that may be referenced via the shippingSettingsLink property of an OfferShippingDetails. Several occurrences can be published, distinguished and matched (i.e. identified/referenced) by their different values for shippingLabel.
subclass of: StructuredValue
source: https://github.com/schemaorg/schemaorg/issues/2506

Hostel
type: Class
comment: A hostel - cheap accommodation, often in shared dormitories. See also the dedicated document on the use of schema.org for marking up hotels and other forms of accommodations.
subclass of: LodgingBusiness

SoldOut
type: ItemAvailability
comment: Indicates that the item has sold out.

Nonprofit501c9
type: USNonprofitType
comment: Nonprofit501c9: Non-profit type referring to Voluntary Employee Beneficiary Associations.
isPartOf: pending.schema.org
source: https://github.com/schemaorg/schemaorg/issues/2543

workPresented
type: Property
comment: The movie presented during this event.
sub property of: workFeatured
domainIncludes: ScreeningEvent
rangeIncludes: Movie

suggestedGender
type: Property
comment: The suggested gender of the intended person or audience, for example "male", "female", or "unisex".
domainIncludes: SizeSpecification
domainIncludes: PeopleAudience
rangeIncludes: Text
rangeIncludes: GenderType

School
type: Class
comment: A school.
subclass of: EducationalOrganization

serviceArea
type: Property
comment: The geographic area where the service is provided.
domainIncludes: Service
domainIncludes: Organization
domainIncludes: ContactPoint
rangeIncludes: GeoShape
rangeIncludes: AdministrativeArea
rangeIncludes: Place
supersededBy: areaServed

Campground
type: Class
comment: A camping site, campsite, or Campground is a place used for overnight stay in the outdoors, typically containing individual CampingPitch locations. \n\n In British English a campsite is an area, usually divided into a number of pitches, where people can camp overnight using tents or camper vans or caravans; this British English use of the word is synonymous with the American English expression campground. In American English the term campsite generally means an area where an individual, family, group, or military unit can pitch a tent or park a camper; a campground may contain many campsites (source: Wikipedia, see [https://en.wikipedia.org/wiki/Campsite](https://en.wikipedia.org/wiki/Campsite)).\n\n See also the dedicated [document on the use of schema.org for marking up hotels and other forms of accommodations](/docs/hotels.html).
subclass of: LodgingBusiness
subclass of: CivicStructure
contributor: STI Accommodation Ontology

mediaItemAppearance
type: Property
comment: In the context of a MediaReview, indicates specific media item(s) that are grouped using a MediaReviewItem.
domainIncludes: MediaReviewItem
isPartOf: pending.schema.org
rangeIncludes: MediaObject
source: https://github.com/schemaorg/schemaorg/issues/2450

musicReleaseFormat
type: Property
comment: Format of this release (the type of recording media used, i.e. compact disc, digital media, LP, etc.).
contributor: MBZ
domainIncludes: MusicRelease
rangeIncludes: MusicReleaseFormatType

leaseLength
type: Property
comment: Length of the lease for some Accommodation, either particular to some Offer or in some cases intrinsic to the property.
domainIncludes: Offer
domainIncludes: Accommodation
domainIncludes: RealEstateListing
isPartOf: pending.schema.org
rangeIncludes: QuantitativeValue
rangeIncludes: Duration
source: https://github.com/schemaorg/schemaorg/issues/2373

itemShipped
type: Property
equivalent property: IncludedConsignmentItem
comment: Item(s) being shipped.
sub property of: hasProduct
domainIncludes: ParcelDelivery
rangeIncludes: Product

Energy
type: Class
comment: Properties that take Energy as values are of the form '<Number> <Energy unit of measure>'.
subclass of: Quantity

offerCount
type: Property
comment: The number of offers for the product.
domainIncludes: AggregateOffer
rangeIncludes: Integer

UnRegisterAction
type: Class
comment: The act of un-registering from a service.\n\nRelated actions:\n\n* RegisterAction: antonym of UnRegisterAction.\n* LeaveAction: Unlike LeaveAction, UnRegisterAction implies that you are unregistering from a service you were previously registered, rather than leaving a team/group of people.
subclass of: InteractAction

LoseAction
type: Class
comment: The act of being defeated in a competitive activity.
subclass of: AchieveAction

relevantSpecialty
type: Property
comment: If applicable, a medical specialty in which this entity is relevant.
domainIncludes: MedicalEntity
isPartOf: health-lifesci.schema.org
rangeIncludes: MedicalSpecialty

PaidLeave
type: GovernmentBenefitsType
comment: PaidLeave: this is a benefit for paid leave.
isPartOf: pending.schema.org
source: https://github.com/schemaorg/schemaorg/issues/2534

typeOfBed
type: Property
comment: The type of bed to which the BedDetail refers, i.e. the type of bed available in the quantity indicated by quantity.
contributor: STI Accommodation Ontology
domainIncludes: BedDetails
rangeIncludes: BedType
rangeIncludes: Text

VeganDiet
type: RestrictedDiet
comment: A diet exclusive of all animal products.

WatchAction
type: Class
comment: The act of consuming dynamic/moving visual content.
subclass of: ConsumeAction

PurchaseTypeNewPurchase
type: PurchaseType
comment: This is a purchase of a new item.
isPartOf: pending.schema.org
source: https://github.com/schemaorg/schemaorg/issues/3572

suitableForDiet
type: Property
comment: Indicates a dietary restriction or guideline for which this recipe or menu item is suitable, e.g. diabetic, halal etc.
domainIncludes: Recipe
domainIncludes: MenuItem
rangeIncludes: Diet
rangeIncludes: RestrictedDiet

VisualArtsEvent
type: Class
comment: Event type: Visual arts event.
subclass of: Event

False
type: Boolean
comment: The boolean value false.

status
type: Property
comment: The status of the study (enumerated).
domainIncludes: MedicalStudy
domainIncludes: MedicalCondition
domainIncludes: MedicalProcedure
isPartOf: health-lifesci.schema.org
rangeIncludes: EventStatusType
rangeIncludes: MedicalStudyStatus
rangeIncludes: Text

specialOpeningHoursSpecification
type: Property
comment: The special opening hours of a certain place.\n\nUse this to explicitly override general opening hours brought in scope by openingHoursSpecification or openingHours.
domainIncludes: Place
rangeIncludes: OpeningHoursSpecification

featureList
type: Property
comment: Features or modules provided by this application (and possibly required by other applications).
domainIncludes: SoftwareApplication
rangeIncludes: Text
rangeIncludes: URL

ConsumeAction
type: Class
comment: The act of ingesting information/resources/food.
subclass of: Action

BedDetails
type: Class
comment: An entity holding detailed information about the available bed types, e.g. the quantity of twin beds for a hotel room. For the single case of just one bed of a certain type, you can use bed directly with a text. See also BedType (under development).
subclass of: Intangible
contributor: STI Accommodation Ontology

MerchantReturnEnumeration
type: Class
comment: Enumerates several kinds of product return policies.
subclass of: Enumeration
isPartOf: pending.schema.org
source: https://github.com/schemaorg/schemaorg/issues/2288

Substance
type: Class
equivalent class: http://purl.bioontology.org/ontology/SNOMEDCT/105590001
comment: Any matter of defined composition that has discrete existence, whose origin may be biological, mineral or chemical.
subclass of: MedicalEntity
isPartOf: health-lifesci.schema.org

Bone
type: Class
comment: Rigid connective tissue that comprises up the skeletal structure of the human body.
subclass of: AnatomicalStructure
isPartOf: health-lifesci.schema.org

EmergencyService
type: Class
comment: An emergency service, such as a fire station or ER.
subclass of: LocalBusiness

Quotation
type: Class
comment: A quotation. Often but not necessarily from some written work, attributable to a real world author and - if associated with a fictional character - to any fictional Person. Use isBasedOn to link to source/origin. The recordedIn property can be used to reference a Quotation from an Event.
subclass of: CreativeWork
isPartOf: pending.schema.org
source: https://github.com/schemaorg/schemaorg/issues/271

includesHealthPlanFormulary
type: Property
comment: Formularies covered by this plan.
domainIncludes: HealthInsurancePlan
isPartOf: pending.schema.org
rangeIncludes: HealthPlanFormulary
source: https://github.com/schemaorg/schemaorg/issues/1062

Cooperative
type: Class
equivalent class: CooperativeSociety
comment: An organization that is a joint project of multiple organizations or persons.
subclass of: Organization

GeoShape
type: Class
comment: The geographic shape of a place. A GeoShape can be described using several properties whose values are based on latitude/longitude pairs. Either whitespace or commas can be used to separate latitude and longitude; whitespace should be used when writing a list of several such points.
subclass of: StructuredValue
contributor: rNews

WearableSizeSystemDE
type: WearableSizeSystemEnumeration
comment: German size system for wearables.
isPartOf: pending.schema.org
source: https://github.com/schemaorg/schemaorg/issues/2811

videoFrameSize
type: Property
comment: The frame size of the video.
domainIncludes: VideoObject
rangeIncludes: Text

arrivalAirport
type: Property
comment: The airport where the flight terminates.
domainIncludes: Flight
rangeIncludes: Airport

dateline
type: Property
comment: A [dateline](https://en.wikipedia.org/wiki/Dateline) is a brief piece of text included in news articles that describes where and when the story was written or filed though the date is often omitted. Sometimes only a placename is provided. Structured representations of dateline-related information can also be expressed more explicitly using locationCreated (which represents where a work was created, e.g. where a news report was written). For location depicted or described in the content, use contentLocation. Dateline summaries are oriented more towards human readers than towards automated processing, and can vary substantially. Some examples: "BEIRUT, Lebanon, June 2.", "Paris, France", "December 19, 2017 11:43AM Reporting from Washington", "Beijing/Moscow", "QUEZON CITY, Philippines".
domainIncludes: NewsArticle
rangeIncludes: Text

deliveryTime
type: Property
comment: The total delay between the receipt of the order and the goods reaching the final customer.
domainIncludes: DeliveryTimeSettings
domainIncludes: OfferShippingDetails
rangeIncludes: ShippingDeliveryTime
source: https://github.com/schemaorg/schemaorg/issues/2506

keywords
type: Property
comment: Keywords or tags used to describe some item. Multiple textual entries in a keywords list are typically delimited by commas, or by repeating the property.
domainIncludes: Organization
domainIncludes: Event
domainIncludes: Place
domainIncludes: CreativeWork
domainIncludes: Product
rangeIncludes: DefinedTerm
rangeIncludes: Text
rangeIncludes: URL

error
type: Property
comment: For failed actions, more information on the cause of the failure. Consider using the Error type.
domainIncludes: Action
rangeIncludes: Thing

verificationFactCheckingPolicy
type: Property
comment: Disclosure about verification and fact-checking processes for a NewsMediaOrganization or other fact-checking Organization.
sub property of: publishingPrinciples
contributor: TP
domainIncludes: NewsMediaOrganization
isPartOf: pending.schema.org
rangeIncludes: CreativeWork
rangeIncludes: URL
source: https://github.com/schemaorg/schemaorg/issues/1525

foodWarning
type: Property
comment: Any precaution, guidance, contraindication, etc. related to consumption of specific foods while taking this drug.
domainIncludes: Drug
isPartOf: health-lifesci.schema.org
rangeIncludes: Text

JoinAction
type: Class
comment: An agent joins an event/group with participants/friends at a location.\n\nRelated actions:\n\n* RegisterAction: Unlike RegisterAction, JoinAction refers to joining a group/team of people.\n* SubscribeAction: Unlike SubscribeAction, JoinAction does not imply that you'll be receiving updates.\n* FollowAction: Unlike FollowAction, JoinAction does not imply that you'll be polling for updates.
subclass of: InteractAction

constraintProperty
type: Property
comment: Indicates a property used as a constraint. For example, in the definition of a StatisticalVariable. The value is a property, either from within Schema.org or from other compatible (e.g. RDF) systems such as DataCommons.org or Wikidata.org.
domainIncludes: ConstraintNode
isPartOf: pending.schema.org
rangeIncludes: Property
rangeIncludes: URL
source: https://github.com/schemaorg/schemaorg/issues/2291

WholesaleStore
type: Class
comment: A wholesale store.
subclass of: Store

vehicleSeatingCapacity
type: Property
comment: The number of passengers that can be seated in the vehicle, both in terms of the physical space available, and in terms of limitations set by law.\n\nTypical unit code(s): C62 for persons.
contributor: Automotive Ontology Working Group
domainIncludes: Vehicle
rangeIncludes: QuantitativeValue
rangeIncludes: Number

ITSocialPromotionCharity
type: ITNonprofitType
comment: ITSocialPromotionCharity: Non-profit type referring to associations promoting charitable causes (Ital. Associazioni di promozione sociale or APS) according to Italian Law 383 of 2000.
isPartOf: pending.schema.org
source: https://github.com/schemaorg/schemaorg/issues/3629

NewsArticle
type: Class
comment: A NewsArticle is an article whose content reports news, or provides background context and supporting materials for understanding the news. A more detailed overview of [schema.org News markup](/docs/news.html) is also available.
subclass of: Article
contributor: rNews
contributor: TP

TaxiReservation
type: Class
comment: A reservation for a taxi.\n\nNote: This type is for information about actual reservations, e.g. in confirmation emails or HTML pages with individual confirmations of reservations. For offers of tickets, use Offer.
subclass of: Reservation

SelfCareHealthAspect
type: HealthAspectEnumeration
comment: Self care actions or measures that can be taken to sooth, health or avoid a topic. This may be carried at home and can be carried/managed by the person itself.
isPartOf: pending.schema.org
source: https://github.com/schemaorg/schemaorg/issues/2374

Nonprofit501c14
type: USNonprofitType
comment: Nonprofit501c14: Non-profit type referring to State-Chartered Credit Unions, Mutual Reserve Funds.
isPartOf: pending.schema.org
source: https://github.com/schemaorg/schemaorg/issues/2543

taxID
type: Property
equivalent property: hasTaxIdentifier
comment: The Tax / Fiscal ID of the organization or person, e.g. the TIN in the US or the CIF/NIF in Spain.
sub property of: identifier
contributor: GoodRelationsTerms
domainIncludes: Organization
domainIncludes: Person
rangeIncludes: Text

AlignmentObject
type: Class
comment: An intangible item that describes an alignment between a learning resource and a node in an educational framework. Should not be used where the nature of the alignment can be described using a simple property, for example to express that a resource teaches or assesses a competency.
subclass of: Intangible
contributor: LRMIClass

CheckInAction
type: Class
comment: The act of an agent communicating (service provider, social media, etc) their arrival by registering/confirming for a previously reserved service (e.g. flight check-in) or at a place (e.g. hotel), possibly resulting in a result (boarding pass, etc).\n\nRelated actions:\n\n* CheckOutAction: The antonym of CheckInAction.\n* ArriveAction: Unlike ArriveAction, CheckInAction implies that the agent is informing/confirming the start of a previously reserved service.\n* ConfirmAction: Unlike ConfirmAction, CheckInAction implies that the agent is informing/confirming the *start* of a previously reserved service rather than its validity/existence.
subclass of: CommunicateAction

purchasePriceLimit
type: Property
comment: Optional. The maximum price the item can have and still qualify for this offer.
domainIncludes: FinancialIncentive
isPartOf: pending.schema.org
rangeIncludes: MonetaryAmount
source: https://github.com/schemaorg/schemaorg/issues/3572

SportingGoodsStore
type: Class
comment: A sporting goods store.
subclass of: Store

RefundTypeEnumeration
type: Class
comment: Enumerates several kinds of product return refund types.
subclass of: Enumeration
isPartOf: pending.schema.org
source: https://github.com/schemaorg/schemaorg/issues/2288

ActionStatusType
type: Class
comment: The status of an Action.
subclass of: StatusEnumeration

Protozoa
type: InfectiousAgentClass
comment: Single-celled organism that causes an infection.
isPartOf: health-lifesci.schema.org

petsAllowed
type: Property
comment: Indicates whether pets are allowed to enter the accommodation or lodging business. More detailed information can be put in a text value.
contributor: STI Accommodation Ontology
domainIncludes: ApartmentComplex
domainIncludes: LodgingBusiness
domainIncludes: Accommodation
domainIncludes: FloorPlan
rangeIncludes: Text
rangeIncludes: Boolean

albums
type: Property
comment: A collection of music albums.
domainIncludes: MusicGroup
rangeIncludes: MusicAlbum
supersededBy: album

ParcelService
type: DeliveryMethod
comment: A private parcel service as the delivery mode available for a certain offer.\n\nCommonly used values:\n\n* http://purl.org/goodrelations/v1#DHL\n* http://purl.org/goodrelations/v1#FederalExpress\n* http://purl.org/goodrelations/v1#UPS
contributor: good-relations-and-schema-org

distribution
type: Property
comment: A downloadable form of this dataset, at a specific location, in a specific format. This property can be repeated if different variations are available. There is no expectation that different downloadable distributions must contain exactly equivalent information (see also [DCAT](https://www.w3.org/TR/vocab-dcat-3/#Class:Distribution) on this point). Different distributions might include or exclude different subsets of the entire dataset, for example.
domainIncludes: Dataset
rangeIncludes: DataDownload

line
type: Property
comment: A line is a point-to-point path consisting of two or more points. A line is expressed as a series of two or more point objects separated by space.
domainIncludes: GeoShape
rangeIncludes: Text

ReservationConfirmed
type: ReservationStatusType
comment: The status of a confirmed reservation.

IncentiveQualifiedExpenseType
type: Class
comment: The types of expenses that are covered by the incentive. For example some incentives are only for the goods (tangible items) but the services (labor) are excluded.
subclass of: Enumeration
isPartOf: pending.schema.org
source: https://github.com/schemaorg/schemaorg/issues/3572

SeaBodyOfWater
type: Class
comment: A sea (for example, the Caspian sea).
subclass of: BodyOfWater

Specialty
type: Class
comment: Any branch of a field in which people typically develop specific expertise, usually after significant study, time, and effort.
subclass of: Enumeration

serviceAudience
type: Property
comment: The audience eligible for this service.
domainIncludes: Service
rangeIncludes: Audience
supersededBy: audience

procedureType
type: Property
comment: The type of procedure, for example Surgical, Noninvasive, or Percutaneous.
domainIncludes: MedicalProcedure
isPartOf: health-lifesci.schema.org
rangeIncludes: MedicalProcedureType

MerchantReturnPolicySeasonalOverride
type: Class
comment: A seasonal override of a return policy, for example used for holidays.
subclass of: Intangible
isPartOf: pending.schema.org
source: https://github.com/schemaorg/schemaorg/issues/2880

map
type: Property
comment: A URL to a map of the place.
domainIncludes: Place
rangeIncludes: URL
supersededBy: hasMap

Pond
type: Class
comment: A pond.
subclass of: BodyOfWater

EventMovedOnline
type: EventStatusType
comment: Indicates that the event was changed to allow online participation. See eventAttendanceMode for specifics of whether it is now fully or partially online.

BodyMeasurementHips
type: BodyMeasurementTypeEnumeration
comment: Girth of hips (measured around the buttocks). Used, for example, to fit skirts.
isPartOf: pending.schema.org
source: https://github.com/schemaorg/schemaorg/issues/2811

downPayment
type: Property
comment: a type of payment made in cash during the onset of the purchase of an expensive good/service. The payment typically represents only a percentage of the full purchase price.
contributor: FIBO
domainIncludes: RepaymentSpecification
isPartOf: pending.schema.org
rangeIncludes: Number
rangeIncludes: MonetaryAmount
source: https://github.com/schemaorg/schemaorg/issues/1253

Dermatology
type: MedicalSpecialty
comment: A specific branch of medical science that pertains to diagnosis and treatment of disorders of skin.
subclass of: MedicalBusiness
isPartOf: health-lifesci.schema.org

carbohydrateContent
type: Property
comment: The number of grams of carbohydrates.
domainIncludes: NutritionInformation
rangeIncludes: Mass

broadcaster
type: Property
comment: The organization owning or operating the broadcast service.
domainIncludes: BroadcastService
rangeIncludes: Organization

requiredQuantity
type: Property
comment: The required quantity of the item(s).
domainIncludes: HowToItem
rangeIncludes: QuantitativeValue
rangeIncludes: Text
rangeIncludes: Number

artEdition
type: Property
comment: The number of copies when multiple copies of a piece of artwork are produced - e.g. for a limited edition of 20 prints, 'artEdition' refers to the total number of copies (in this example "20").
domainIncludes: VisualArtwork
rangeIncludes: Text
rangeIncludes: Integer

businessFunction
type: Property
comment: The business function (e.g. sell, lease, repair, dispose) of the offer or component of a bundle (TypeAndQuantityNode). The default is http://purl.org/goodrelations/v1#Sell.
contributor: GoodRelationsTerms
domainIncludes: Offer
domainIncludes: TypeAndQuantityNode
domainIncludes: Demand
rangeIncludes: BusinessFunction

TypeAndQuantityNode
type: Class
comment: A structured value indicating the quantity, unit of measurement, and business function of goods included in a bundle offer.
subclass of: StructuredValue
contributor: good-relations-and-schema-org

accessibilitySummary
type: Property
comment: A human-readable summary of specific accessibility features or deficiencies, consistent with the other accessibility metadata but expressing subtleties such as "short descriptions are present but long descriptions will be needed for non-visual users" or "short descriptions are present and no long descriptions are needed".
domainIncludes: CreativeWork
rangeIncludes: Text
source: https://github.com/schemaorg/schemaorg/issues/1100

photo
type: Property
comment: A photograph of this place.
sub property of: image
domainIncludes: Place
rangeIncludes: Photograph
rangeIncludes: ImageObject

cvdNumICUBedsOcc
type: Property
comment: numicubedsocc - ICU BED OCCUPANCY: Total number of staffed inpatient ICU beds that are occupied.
domainIncludes: CDCPMDRecord
isPartOf: pending.schema.org
rangeIncludes: Number
source: https://github.com/schemaorg/schemaorg/issues/2521

targetDescription
type: Property
comment: The description of a node in an established educational framework.
domainIncludes: AlignmentObject
rangeIncludes: Text

ReservationCancelled
type: ReservationStatusType
comment: The status for a previously confirmed reservation that is now cancelled.

TollFree
type: ContactPointOption
comment: The associated telephone number is toll free.

NewsMediaOrganization
type: Class
comment: A News/Media organization such as a newspaper or TV station.
subclass of: Organization
contributor: TP
isPartOf: pending.schema.org
source: https://github.com/schemaorg/schemaorg/issues/1525

Anesthesia
type: MedicalSpecialty
comment: A specific branch of medical science that pertains to study of anesthetics and their application.
isPartOf: health-lifesci.schema.org

EventRescheduled
type: EventStatusType
comment: The event has been rescheduled. The event's previousStartDate should be set to the old date and the startDate should be set to the event's new date. (If the event has been rescheduled multiple times, the previousStartDate property may be repeated.)

publishingPrinciples
type: Property
comment: The publishingPrinciples property indicates (typically via URL) a document describing the editorial principles of an Organization (or individual, e.g. a Person writing a blog) that relate to their activities as a publisher, e.g. ethics or diversity policies. When applied to a CreativeWork (e.g. NewsArticle) the principles are those of the party primarily responsible for the creation of the CreativeWork. While such policies are most typically expressed in natural language, sometimes related information (e.g. indicating a funder) can be expressed using schema.org terminology.
domainIncludes: Organization
domainIncludes: Person
domainIncludes: CreativeWork
rangeIncludes: CreativeWork
rangeIncludes: URL

correctionsPolicy
type: Property
comment: For an Organization (e.g. NewsMediaOrganization), a statement describing (in news media, the newsroom’s) disclosure and correction policy for errors.
sub property of: publishingPrinciples
contributor: TP
domainIncludes: NewsMediaOrganization
domainIncludes: Organization
isPartOf: pending.schema.org
rangeIncludes: URL
rangeIncludes: CreativeWork
source: https://github.com/schemaorg/schemaorg/issues/1525

applicableCountry
type: Property
comment: A country where a particular merchant return policy applies to, for example the two-letter ISO 3166-1 alpha-2 country code.
domainIncludes: MerchantReturnPolicy
isPartOf: pending.schema.org
rangeIncludes: Country
rangeIncludes: Text
source: https://github.com/schemaorg/schemaorg/issues/3001

publisher
type: Property
equivalent property: publisher
comment: The publisher of the article in question.
domainIncludes: CreativeWork
domainIncludes: FinancialIncentive
rangeIncludes: Organization
rangeIncludes: Person

Seat
type: Class
comment: Used to describe a seat, such as a reserved seat in an event reservation.
subclass of: Intangible

manufacturer
type: Property
equivalent property: manufacturerParty
equivalent property: manufacturer
comment: The manufacturer of the product.
sub property of: isProvisionedBy
domainIncludes: Product
rangeIncludes: Organization

ParkingMap
type: MapCategoryType
comment: A parking map.

FindAction
type: Class
comment: The act of finding an object.\n\nRelated actions:\n\n* SearchAction: FindAction is generally lead by a SearchAction, but not necessarily.
subclass of: Action

EventAttendanceModeEnumeration
type: Class
comment: An EventAttendanceModeEnumeration value is one of potentially several modes of organising an event, relating to whether it is online or offline.
subclass of: Enumeration
isPartOf: pending.schema.org
source: https://github.com/schemaorg/schemaorg/issues/1842

characterAttribute
type: Property
comment: A piece of data that represents a particular aspect of a fictional character (skill, power, character points, advantage, disadvantage).
domainIncludes: VideoGameSeries
domainIncludes: Game
rangeIncludes: Thing

BusStop
type: Class
comment: A bus stop.
subclass of: CivicStructure

Boolean
type: Class
type: DataType
comment: Boolean: True or False.

IndividualPhysician
type: Class
comment: An individual medical practitioner. For their official address use address, for affiliations to hospitals use hospitalAffiliation. The practicesAt property can be used to indicate MedicalOrganization hospitals, clinics, pharmacies etc. where this physician practices.
subclass of: Physician

VideoObject
type: Class
comment: A video file.
subclass of: MediaObject
contributor: rNews

EndorseAction
type: Class
comment: An agent approves/certifies/likes/supports/sanctions an object.
subclass of: ReactAction

ViewAction
type: Class
comment: The act of consuming static visual content.
subclass of: ConsumeAction

availability
type: Property
comment: The availability of this item—for example In stock, Out of stock, Pre-order, etc.
domainIncludes: Demand
domainIncludes: Offer
rangeIncludes: ItemAvailability

ChildrensEvent
type: Class
comment: Event type: Children's event.
subclass of: Event

engineDisplacement
type: Property
comment: The volume swept by all of the pistons inside the cylinders of an internal combustion engine in a single movement. \n\nTypical unit code(s): CMQ for cubic centimeter, LTR for liters, INQ for cubic inches\n* Note 1: You can link to information about how the given value has been determined using the valueReference property.\n* Note 2: You can use minValue and maxValue to indicate ranges.
contributor: Automotive Ontology Working Group
domainIncludes: EngineSpecification
isPartOf: auto.schema.org
rangeIncludes: QuantitativeValue

DietNutrition
type: MedicalSpecialty
comment: Dietetics and nutrition as a medical specialty.
subclass of: MedicalBusiness
isPartOf: health-lifesci.schema.org

datePublished
type: Property
comment: Date of first publication or broadcast. For example the date a CreativeWork was broadcast or a Certification was issued.
domainIncludes: Certification
domainIncludes: CreativeWork
rangeIncludes: Date
rangeIncludes: DateTime

MedicalBusiness
type: Class
comment: A particular physical or virtual business of an organization for medical purposes. Examples of MedicalBusiness include different businesses run by health professionals.
subclass of: LocalBusiness
isPartOf: health-lifesci.schema.org

PostOffice
type: Class
comment: A post office.
subclass of: GovernmentOffice

legalName
type: Property
equivalent property: hasLegalName
equivalent property: organizationLegalName
comment: The official name of the organization, e.g. the registered company name.
sub property of: hasName
contributor: GoodRelationsTerms
domainIncludes: Organization
rangeIncludes: Text

OrderDelivered
type: OrderStatus
comment: OrderStatus representing successful delivery of an order.

liveBlogUpdate
type: Property
comment: An update to the LiveBlog.
domainIncludes: LiveBlogPosting
rangeIncludes: BlogPosting

ScreenCaptureDigitalSource
type: IPTCDigitalSourceEnumeration
comment: Content coded as 'algorithmic media' using the IPTC digital source type vocabulary.
isPartOf: pending.schema.org
source: https://github.com/schemaorg/schemaorg/issues/3392

CardiovascularExam
type: PhysicalExam
comment: Cardiovascular system assessment with clinical examination.
isPartOf: health-lifesci.schema.org

catalogNumber
type: Property
comment: The catalog number for the release.
contributor: MBZ
domainIncludes: MusicRelease
rangeIncludes: Text

repeatFrequency
type: Property
comment: Defines the frequency at which Events will occur according to a schedule Schedule. The intervals between events should be defined as a Duration of time.
sub property of: frequency
domainIncludes: Schedule
isPartOf: pending.schema.org
rangeIncludes: Text
rangeIncludes: Duration
source: https://github.com/schemaorg/schemaorg/issues/1457

member
type: Property
equivalent property: hasMember
comment: A member of an Organization or a ProgramMembership. Organizations can be members of organizations; ProgramMembership is typically for individuals.
domainIncludes: Organization
domainIncludes: ProgramMembership
inverseOf: memberOf
rangeIncludes: Organization
rangeIncludes: Person

applicationSubCategory
type: Property
comment: Subcategory of the application, e.g. 'Arcade Game'.
domainIncludes: SoftwareApplication
rangeIncludes: Text
rangeIncludes: URL

ScreeningHealthAspect
type: HealthAspectEnumeration
comment: Content about how to screen or further filter a topic.
isPartOf: pending.schema.org
source: https://github.com/schemaorg/schemaorg/issues/2374

healthPlanCopayOption
type: Property
comment: Whether the copay is before or after deductible, etc. TODO: Is this a closed set?
domainIncludes: HealthPlanCostSharingSpecification
isPartOf: pending.schema.org
rangeIncludes: Text
source: https://github.com/schemaorg/schemaorg/issues/1062

timestamp
type: Property
equivalent class: atTime
comment: The instant the event occured.
domainIncludes: InstantaneousEvent
isPartOf: pending.schema.org
rangeIncludes: DateTime
source: https://github.com/schemaorg/schemaorg/issues/4527

fileSize
type: Property
comment: Size of the application / package (e.g. 18MB). In the absence of a unit (MB, KB etc.), KB will be assumed.
domainIncludes: SoftwareApplication
rangeIncludes: Text

authenticator
type: Property
comment: The Organization responsible for authenticating the user's subscription. For example, many media apps require a cable/satellite provider to authenticate your subscription before playing media.
domainIncludes: MediaSubscription
rangeIncludes: Organization
source: https://github.com/schemaorg/schemaorg/issues/1741

artist
type: Property
comment: The primary artist for a work in a medium other than pencils or digital line art--for example, if the primary artwork is done in watercolors or digital paints.
domainIncludes: VisualArtwork
domainIncludes: ComicStory
domainIncludes: ComicIssue
isPartOf: bib.schema.org
rangeIncludes: Person

paymentDueDate
type: Property
equivalent property: PaymentDueDate
comment: The date that payment is due.
domainIncludes: Invoice
domainIncludes: Order
rangeIncludes: DateTime
rangeIncludes: Date

legislationChanges
type: Property
equivalent property: changes
comment: Another legislation that this legislation changes. This encompasses the notions of amendment, replacement, correction, repeal, or other types of change. This may be a direct change (textual or non-textual amendment) or a consequential or indirect change. The property is to be used to express the existence of a change relationship between two acts rather than the existence of a consolidated version of the text that shows the result of the change. For consolidation relationships, use the legislationConsolidates property.
contributor: ELI
domainIncludes: Legislation
isPartOf: pending.schema.org
rangeIncludes: Legislation
source: https://github.com/schemaorg/schemaorg/issues/1156
source: eli

Gastroenterologic
type: MedicalSpecialty
comment: A specific branch of medical science that pertains to diagnosis and treatment of disorders of digestive system.
isPartOf: health-lifesci.schema.org

tributary
type: Property
comment: The anatomical or organ system that the vein flows into; a larger structure that the vein connects to.
domainIncludes: Vein
isPartOf: health-lifesci.schema.org
rangeIncludes: AnatomicalStructure

hasBioPolymerSequence
type: Property
comment: A symbolic representation of a BioChemEntity. For example, a nucleotide sequence of a Gene or an amino acid sequence of a Protein.
sub property of: hasRepresentation
domainIncludes: Protein
domainIncludes: Gene
isPartOf: pending.schema.org
rangeIncludes: Text
source: Gene

MerchantReturnPolicy
type: Class
comment: A MerchantReturnPolicy provides information about product return policies associated with an Organization, Product, or Offer.
subclass of: Intangible
isPartOf: pending.schema.org
source: https://github.com/schemaorg/schemaorg/issues/2288

Church
type: Class
comment: A church.
subclass of: PlaceOfWorship

Psychiatric
type: MedicalSpecialty
comment: A specific branch of medical science that is concerned with the study, treatment, and prevention of mental illness, using both medical and psychological therapies.
subclass of: MedicalBusiness
isPartOf: health-lifesci.schema.org

composer
type: Property
comment: The person or organization who wrote a composition, or who is the composer of a work performed at some event.
contributor: MBZ
domainIncludes: Event
domainIncludes: MusicComposition
rangeIncludes: Organization
rangeIncludes: Person

SchoolDistrict
type: Class
comment: A School District is an administrative area for the administration of schools.
subclass of: AdministrativeArea
isPartOf: pending.schema.org
source: https://github.com/schemaorg/schemaorg/issues/2500

fuelConsumption
type: Property
comment: The amount of fuel consumed for traveling a particular distance or temporal duration with the given vehicle (e.g. liters per 100 km).\n\n* Note 1: There are unfortunately no standard unit codes for liters per 100 km. Use unitText to indicate the unit of measurement, e.g. L/100 km.\n* Note 2: There are two ways of indicating the fuel consumption, fuelConsumption (e.g. 8 liters per 100 km) and fuelEfficiency (e.g. 30 miles per gallon). They are reciprocal.\n* Note 3: Often, the absolute value is useful only when related to driving speed ("at 80 km/h") or usage pattern ("city traffic"). You can use valueReference to link the value for the fuel consumption to another value.
contributor: Automotive Ontology Working Group
domainIncludes: Vehicle
rangeIncludes: QuantitativeValue

suggestedAnswer
type: Property
comment: An answer (possibly one of several, possibly incorrect) to a Question, e.g. on a Question/Answer site.
domainIncludes: Question
rangeIncludes: ItemList
rangeIncludes: Answer

WearableSizeSystemFR
type: WearableSizeSystemEnumeration
comment: French size system for wearables.
isPartOf: pending.schema.org
source: https://github.com/schemaorg/schemaorg/issues/2811

NonprofitSBBI
type: NLNonprofitType
comment: NonprofitSBBI: Non-profit type referring to a Social Interest Promoting Institution (NL).
isPartOf: pending.schema.org
source: https://github.com/schemaorg/schemaorg/issues/2543

EventVenue
type: Class
comment: An event venue.
subclass of: CivicStructure

addressLocality
type: Property
equivalent property: hasMunicipality
equivalent property: addressLocality
comment: The locality in which the street address is, and which is in the region. For example, Mountain View.
domainIncludes: PostalAddress
rangeIncludes: Text

WriteAction
type: Class
comment: The act of authoring written creative content.
subclass of: CreateAction

depth
type: Property
comment: The depth of the item.
contributor: GoodRelationsTerms
domainIncludes: OfferShippingDetails
domainIncludes: ShippingConditions
domainIncludes: Product
domainIncludes: VisualArtwork
rangeIncludes: QuantitativeValue
rangeIncludes: Distance
source: https://github.com/schemaorg/schemaorg/issues/3617

safetyConsideration
type: Property
comment: Any potential safety concern associated with the supplement. May include interactions with other drugs and foods, pregnancy, breastfeeding, known adverse reactions, and documented efficacy of the supplement.
domainIncludes: DietarySupplement
isPartOf: health-lifesci.schema.org
rangeIncludes: Text

transFatContent
type: Property
comment: The number of grams of trans fat.
domainIncludes: NutritionInformation
rangeIncludes: Mass

aspect
type: Property
comment: An aspect of medical practice that is considered on the page, such as 'diagnosis', 'treatment', 'causes', 'prognosis', 'etiology', 'epidemiology', etc.
domainIncludes: MedicalWebPage
isPartOf: health-lifesci.schema.org
rangeIncludes: Text
supersededBy: mainContentOfPage

geoMidpoint
type: Property
comment: Indicates the GeoCoordinates at the centre of a GeoShape, e.g. GeoCircle.
domainIncludes: GeoCircle
rangeIncludes: GeoCoordinates

WearableSizeGroupJuniors
type: WearableSizeGroupEnumeration
comment: Size group "Juniors" for wearables.
isPartOf: pending.schema.org
source: https://github.com/schemaorg/schemaorg/issues/2811

NailSalon
type: Class
comment: A nail salon.
subclass of: HealthAndBeautyBusiness

Nonprofit501c2
type: USNonprofitType
comment: Nonprofit501c2: Non-profit type referring to Title-holding Corporations for Exempt Organizations.
isPartOf: pending.schema.org
source: https://github.com/schemaorg/schemaorg/issues/2543

menu
type: Property
comment: Either the actual menu as a structured representation, as text, or a URL of the menu.
domainIncludes: FoodEstablishment
rangeIncludes: Menu
rangeIncludes: Text
rangeIncludes: URL
supersededBy: hasMenu

MathSolver
type: Class
comment: A math solver which is capable of solving a subset of mathematical problems.
subclass of: CreativeWork
isPartOf: pending.schema.org
source: https://github.com/schemaorg/schemaorg/issues/2740

DisabilitySupport
type: GovernmentBenefitsType
comment: DisabilitySupport: this is a benefit for disability support.
isPartOf: pending.schema.org
source: https://github.com/schemaorg/schemaorg/issues/2534

hasDigitalDocumentPermission
type: Property
comment: A permission related to the access to this document (e.g. permission to read or write an electronic document). For a public document, specify a grantee with an Audience with audienceType equal to "public".
domainIncludes: DigitalDocument
rangeIncludes: DigitalDocumentPermission

ElementarySchool
type: Class
comment: An elementary school.
subclass of: EducationalOrganization

MedicalDevicePurpose
type: Class
comment: Categories of medical devices, organized by the purpose or intended use of the device.
subclass of: MedicalEnumeration
isPartOf: health-lifesci.schema.org

Vein
type: Class
comment: A type of blood vessel that specifically carries blood to the heart.
subclass of: Vessel
isPartOf: health-lifesci.schema.org

OnlineStore
type: Class
comment: An eCommerce site.
subclass of: OnlineBusiness
isPartOf: pending.schema.org
source: https://github.com/schemaorg/schemaorg/issues/3028

Reservoir
type: Class
comment: A reservoir of water, typically an artificially created lake, like the Lake Kariba reservoir.
subclass of: BodyOfWater

Place
type: Class
equivalent class: Location
comment: Entities that have a somewhat fixed, physical extension.
subclass of: Thing

hasCourseInstance
type: Property
comment: An offering of the course at a specific time and place or through specific media or mode of study or to a specific section of students.
domainIncludes: Course
rangeIncludes: CourseInstance

opponent
type: Property
comment: A sub property of participant. The opponent on this action.
sub property of: participant
domainIncludes: ExerciseAction
rangeIncludes: Person

floorLimit
type: Property
comment: A floor limit is the amount of money above which credit card transactions must be authorized.
contributor: FIBO
domainIncludes: PaymentCard
isPartOf: pending.schema.org
rangeIncludes: MonetaryAmount
source: https://github.com/schemaorg/schemaorg/issues/1253

TreatmentIndication
type: Class
comment: An indication for treating an underlying condition, symptom, etc.
subclass of: MedicalIndication
isPartOf: health-lifesci.schema.org

EUEnergyEfficiencyCategoryA1Plus
type: EUEnergyEfficiencyEnumeration
comment: Represents EU Energy Efficiency Class A+ as defined in EU energy labeling regulations.
isPartOf: pending.schema.org
source: https://github.com/schemaorg/schemaorg/issues/2670

noBylinesPolicy
type: Property
comment: For a NewsMediaOrganization or other news-related Organization, a statement explaining when authors of articles are not named in bylines.
sub property of: publishingPrinciples
contributor: TP
domainIncludes: NewsMediaOrganization
isPartOf: pending.schema.org
rangeIncludes: CreativeWork
rangeIncludes: URL
source: https://github.com/schemaorg/schemaorg/issues/1688

sku
type: Property
equivalent property: sellerAssignedId
comment: The Stock Keeping Unit (SKU), i.e. a merchant-specific identifier for a product or service, or the product to which the offer refers.
sub property of: identifier
contributor: GoodRelationsTerms
domainIncludes: Product
domainIncludes: Offer
domainIncludes: Demand
rangeIncludes: Text

unnamedSourcesPolicy
type: Property
comment: For an Organization (typically a NewsMediaOrganization), a statement about policy on use of unnamed sources and the decision process required.
sub property of: publishingPrinciples
contributor: TP
domainIncludes: NewsMediaOrganization
domainIncludes: Organization
isPartOf: pending.schema.org
rangeIncludes: CreativeWork
rangeIncludes: URL
source: https://github.com/schemaorg/schemaorg/issues/1525

hasOfferCatalog
type: Property
comment: Indicates an OfferCatalog listing for this Organization, Person, or Service.
domainIncludes: Organization
domainIncludes: Person
domainIncludes: Service
rangeIncludes: OfferCatalog

Virus
type: InfectiousAgentClass
comment: Pathogenic virus that causes viral infection.
isPartOf: health-lifesci.schema.org

membershipPointsEarned
type: Property
comment: The number of membership points earned by the member. If necessary, the unitText can be used to express the units the points are issued in. (E.g. stars, miles, etc.)
domainIncludes: ProgramMembership
domainIncludes: PriceSpecification
domainIncludes: MemberProgramTier
isPartOf: pending.schema.org
rangeIncludes: Number
rangeIncludes: QuantitativeValue
source: https://github.com/schemaorg/schemaorg/issues/2085

suggestedMinAge
type: Property
comment: Minimum recommended age in years for the audience or user.
domainIncludes: PeopleAudience
rangeIncludes: Number

trainingSalary
type: Property
comment: The estimated salary earned while in the program.
domainIncludes: WorkBasedProgram
domainIncludes: EducationalOccupationalProgram
isPartOf: pending.schema.org
rangeIncludes: MonetaryAmountDistribution
source: https://github.com/schemaorg/schemaorg/issues/2289
source: https://github.com/schemaorg/schemaorg/issues/2460

preparation
type: Property
comment: Typical preparation that a patient must undergo before having the procedure performed.
domainIncludes: MedicalProcedure
isPartOf: health-lifesci.schema.org
rangeIncludes: MedicalEntity
rangeIncludes: Text

reviewRating
type: Property
comment: The rating given in this review. Note that reviews can themselves be rated. The ```reviewRating``` applies to rating given by the review. The aggregateRating property applies to the review itself, as a creative work.
domainIncludes: Review
rangeIncludes: Rating

Renal
type: MedicalSpecialty
comment: A specific branch of medical science that pertains to the study of the kidneys and its respective disease states.
isPartOf: health-lifesci.schema.org

accountOverdraftLimit
type: Property
comment: An overdraft is an extension of credit from a lending institution when an account reaches zero. An overdraft allows the individual to continue withdrawing money even if the account has no funds in it. Basically the bank allows people to borrow a set amount of money.
contributor: FIBO
domainIncludes: BankAccount
isPartOf: pending.schema.org
rangeIncludes: MonetaryAmount
source: https://github.com/schemaorg/schemaorg/issues/1253

Gene
type: Class
comment: A discrete unit of inheritance which affects one or more biological traits (Source: [https://en.wikipedia.org/wiki/Gene](https://en.wikipedia.org/wiki/Gene)). Examples include FOXP2 (Forkhead box protein P2), SCARNA21 (small Cajal body-specific RNA 21), A- (agouti genotype).
subclass of: BioChemEntity
isPartOf: pending.schema.org
source: bioschemas.org

Nonprofit501c20
type: USNonprofitType
comment: Nonprofit501c20: Non-profit type referring to Group Legal Services Plan Organizations.
isPartOf: pending.schema.org
source: https://github.com/schemaorg/schemaorg/issues/2543

vehicleConfiguration
type: Property
comment: A short text indicating the configuration of the vehicle, e.g. '5dr hatchback ST 2.5 MT 225 hp' or 'limited edition'.
contributor: Automotive Ontology Working Group
domainIncludes: Vehicle
rangeIncludes: Text

PartiallyInForce
type: LegalForceStatus
comment: Indicates that parts of the legislation are in force, and parts are not.
contributor: ELI
isPartOf: pending.schema.org
source: eli
source: https://github.com/schemaorg/schemaorg/issues/1156

SinglePlayer
type: GamePlayMode
comment: Play mode: SinglePlayer. Which is played by a lone player.

dropoffTime
type: Property
comment: When a rental car can be dropped off.
domainIncludes: RentalCarReservation
rangeIncludes: DateTime

EUEnergyEfficiencyEnumeration
type: Class
comment: Enumerates the EU energy efficiency classes A-G as well as A+, A++, and A+++ as defined in EU directive 2017/1369.
subclass of: EnergyEfficiencyEnumeration
isPartOf: pending.schema.org
source: https://github.com/schemaorg/schemaorg/issues/2670

AnatomicalStructure
type: Class
comment: Any part of the human body, typically a component of an anatomical system. Organs, tissues, and cells are all anatomical structures.
subclass of: MedicalEntity
isPartOf: health-lifesci.schema.org

deliveryMethod
type: Property
comment: A sub property of instrument. The method of delivery.
sub property of: instrument
domainIncludes: TrackAction
domainIncludes: OrderAction
domainIncludes: ReceiveAction
domainIncludes: SendAction
rangeIncludes: DeliveryMethod

AdvertiserContentArticle
type: Class
comment: An Article that an external entity has paid to place or to produce to its specifications. Includes [advertorials](https://en.wikipedia.org/wiki/Advertorial), sponsored content, native advertising and other paid content.
subclass of: Article
contributor: TP
isPartOf: pending.schema.org
source: https://github.com/schemaorg/schemaorg/issues/1525

instrument
type: Property
comment: The object that helped the agent perform the action. E.g. John wrote a book with *a pen*.
domainIncludes: Action
rangeIncludes: Thing

isStoreOn
type: Property
comment: The eCommerce marketplace this online store is on.
domainIncludes: OnlineStore
isPartOf: pending.schema.org
rangeIncludes: OnlineMarketplace
source: https://github.com/schemaorg/schemaorg/issues/4470

termDuration
type: Property
comment: The amount of time in a term as defined by the institution. A term is a length of time where students take one or more classes. Semesters and quarters are common units for term.
domainIncludes: EducationalOccupationalProgram
isPartOf: pending.schema.org
rangeIncludes: Duration
source: https://github.com/schemaorg/schemaorg/issues/2419

volumeNumber
type: Property
equivalent property: volume
comment: Identifies the volume of publication or multi-part work; for example, "iii" or "2".
sub property of: position
contributor: bibex
domainIncludes: PublicationVolume
rangeIncludes: Integer
rangeIncludes: Text

PostalAddress
type: Class
equivalent class: PostalAddress
equivalent class: TradeAddress
equivalent class: Address
comment: The mailing address.
subclass of: ContactPoint

TobaccoNicotineConsideration
type: AdultOrientedEnumeration
comment: Item contains tobacco and/or nicotine, for example cigars, cigarettes, chewing tobacco, e-cigarettes, or hookahs.
isPartOf: pending.schema.org
source: https://github.com/schemaorg/schemaorg/issues/2989

reviewedBy
type: Property
comment: People or organizations that have reviewed the content on this web page for accuracy and/or completeness.
domainIncludes: WebPage
rangeIncludes: Organization
rangeIncludes: Person

measurementTechnique
type: Property
comment: A technique, method or technology used in an Observation, StatisticalVariable or Dataset (or DataDownload, DataCatalog), corresponding to the method used for measuring the corresponding variable(s) (for datasets, described using variableMeasured; for Observation, a StatisticalVariable). Often but not necessarily each variableMeasured will have an explicit representation as (or mapping to) an property such as those defined in Schema.org, or other RDF vocabularies and "knowledge graphs". In that case the subproperty of variableMeasured called measuredProperty is applicable. The measurementTechnique property helps when extra clarification is needed about how a measuredProperty was measured. This is oriented towards scientific and scholarly dataset publication but may have broader applicability; it is not intended as a full representation of measurement, but can often serve as a high level summary for dataset discovery. For example, if variableMeasured is: molecule concentration, measurementTechnique could be: "mass spectrometry" or "nmr spectroscopy" or "colorimetry" or "immunofluorescence". If the variableMeasured is "depression rating", the measurementTechnique could be "Zung Scale" or "HAM-D" or "Beck Depression Inventory". If there are several variableMeasured properties recorded for some given data object, use a PropertyValue for each variableMeasured and attach the corresponding measurementTechnique. The value can also be from an enumeration, organized as a MeasurementMethodEnum.
domainIncludes: DataCatalog
domainIncludes: StatisticalVariable
domainIncludes: Dataset
domainIncludes: DataDownload
domainIncludes: PropertyValue
domainIncludes: Observation
isPartOf: pending.schema.org
rangeIncludes: Text
rangeIncludes: URL
rangeIncludes: MeasurementMethodEnum
rangeIncludes: DefinedTerm
source: https://github.com/schemaorg/schemaorg/issues/1425

weight
type: Property
comment: The weight of the product or person.
contributor: GoodRelationsTerms
domainIncludes: Product
domainIncludes: VisualArtwork
domainIncludes: OfferShippingDetails
domainIncludes: Person
domainIncludes: ShippingConditions
rangeIncludes: QuantitativeValue
rangeIncludes: Mass
source: https://github.com/schemaorg/schemaorg/issues/3617

TripleBlindedTrial
type: MedicalTrialDesign
comment: A trial design in which neither the researcher, the person administering the therapy nor the patient knows the details of the treatment the patient was randomly assigned to.
isPartOf: health-lifesci.schema.org

AggregateRating
type: Class
comment: The average rating based on multiple ratings or reviews.
subclass of: Rating

PaymentDue
type: PaymentStatusType
comment: The payment is due, but still within an acceptable time to be received.

ShoppingCenter
type: Class
comment: A shopping center or mall.
subclass of: LocalBusiness

CollegeOrUniversity
type: Class
comment: A college, university, or other third-level educational institution.
subclass of: EducationalOrganization

exerciseType
type: Property
comment: Type(s) of exercise or activity, such as strength training, flexibility training, aerobics, cardiac rehabilitation, etc.
domainIncludes: ExercisePlan
domainIncludes: ExerciseAction
isPartOf: health-lifesci.schema.org
rangeIncludes: Text

storageRequirements
type: Property
comment: Storage requirements (free space required).
domainIncludes: SoftwareApplication
rangeIncludes: Text
rangeIncludes: URL

yearlyRevenue
type: Property
comment: The size of the business in annual revenue.
domainIncludes: BusinessAudience
rangeIncludes: QuantitativeValue

DrugLegalStatus
type: Class
comment: The legal availability status of a medical drug.
subclass of: MedicalIntangible
isPartOf: health-lifesci.schema.org

interpretedAsClaim
type: Property
comment: Used to indicate a specific claim contained, implied, translated or refined from the content of a MediaObject or other CreativeWork. The interpreting party can be indicated using claimInterpreter.
sub property of: description
domainIncludes: MediaObject
domainIncludes: CreativeWork
isPartOf: pending.schema.org
rangeIncludes: Claim
source: https://github.com/schemaorg/schemaorg/issues/2450

bookFormat
type: Property
comment: The format of the book.
domainIncludes: Book
rangeIncludes: BookFormatType

AutoPartsStore
type: Class
comment: An auto parts store.
subclass of: Store
subclass of: AutomotiveBusiness

replyToUrl
type: Property
comment: The URL at which a reply may be posted to the specified UserComment.
domainIncludes: UserComments
rangeIncludes: URL

broadcastOfEvent
type: Property
comment: The event being broadcast such as a sporting event or awards ceremony.
domainIncludes: BroadcastEvent
rangeIncludes: Event

Male
type: GenderType
comment: The male gender.

readonlyValue
type: Property
comment: Whether or not a property is mutable. Default is false. Specifying this for a property that also has a value makes it act similar to a "hidden" input in an HTML form.
domainIncludes: PropertyValueSpecification
rangeIncludes: Boolean

funding
type: Property
comment: A Grant that directly or indirectly provide funding or sponsorship for this item. See also ownershipFundingInfo.
contributor: TP
domainIncludes: MedicalEntity
domainIncludes: Event
domainIncludes: Organization
domainIncludes: BioChemEntity
domainIncludes: Person
domainIncludes: CreativeWork
domainIncludes: Product
inverseOf: fundedItem
isPartOf: pending.schema.org
rangeIncludes: Grant
source: https://github.com/schemaorg/schemaorg/issues/383

ListPrice
type: PriceTypeEnumeration
comment: Represents the list price of an offered product. Typically the same as the [MSRP](https://schema.org/MSRP).
isPartOf: pending.schema.org
source: https://github.com/schemaorg/schemaorg/issues/2712

FoodService
type: Class
comment: A food service, like breakfast, lunch, or dinner.
subclass of: Service
contributor: STI Accommodation Ontology

SiteNavigationElement
type: Class
comment: A navigation element of the page.
subclass of: WebPageElement

maximumEnrollment
type: Property
comment: The maximum number of students who may be enrolled in the program.
domainIncludes: EducationalOccupationalProgram
isPartOf: pending.schema.org
rangeIncludes: Integer
source: https://github.com/schemaorg/schemaorg/issues/2419

CreativeWork
type: Class
comment: The most generic kind of creative work, including books, movies, photographs, software programs, etc.
subclass of: Thing
contributor: rNews

OfflinePermanently
type: GameServerStatus
comment: Game server status: OfflinePermanently. Server is offline and not available.

availableAtOrFrom
type: Property
comment: The place(s) from which the offer can be obtained (e.g. store locations).
sub property of: areaServed
contributor: GoodRelationsTerms
domainIncludes: Offer
domainIncludes: Demand
rangeIncludes: Place

engineType
type: Property
comment: The type of engine or engines powering the vehicle.
contributor: Automotive Ontology Working Group
domainIncludes: EngineSpecification
isPartOf: auto.schema.org
rangeIncludes: Text
rangeIncludes: URL
rangeIncludes: QualitativeValue

Movie
type: Class
comment: A movie.
subclass of: CreativeWork

LocalBusiness
type: Class
comment: A particular physical business or branch of an organization. Examples of LocalBusiness include a restaurant, a particular branch of a restaurant chain, a branch of a bank, a medical practice, a club, a bowling alley, etc.
subclass of: Place
subclass of: Organization

ComputerLanguage
type: Class
comment: This type covers computer programming languages such as Scheme and Lisp, as well as other language-like computer representations. Natural languages are best represented with the Language type.
subclass of: Intangible

warranty
type: Property
comment: The warranty promise(s) included in the offer.
contributor: GoodRelationsTerms
domainIncludes: Demand
domainIncludes: Offer
rangeIncludes: WarrantyPromise

ownedThrough
type: Property
comment: The date and time of giving up ownership on the product.
contributor: GoodRelationsTerms
domainIncludes: OwnershipInfo
rangeIncludes: DateTime

doseValue
type: Property
comment: The value of the dose, e.g. 500.
domainIncludes: DoseSchedule
isPartOf: health-lifesci.schema.org
rangeIncludes: Number
rangeIncludes: QualitativeValue

deliveryAddress
type: Property
equivalent property: ShipToAddress
comment: Destination address.
domainIncludes: ParcelDelivery
rangeIncludes: PostalAddress

EvidenceLevelB
type: MedicalEvidenceLevel
comment: Data derived from a single randomized trial, or nonrandomized studies.
isPartOf: health-lifesci.schema.org

hasEnergyConsumptionDetails
type: Property
comment: Defines the energy efficiency Category (also known as "class" or "rating") for a product according to an international energy efficiency standard.
domainIncludes: Product
isPartOf: pending.schema.org
rangeIncludes: EnergyConsumptionDetails
source: https://github.com/schemaorg/schemaorg/issues/2670

softwareHelp
type: Property
comment: Software application help.
domainIncludes: SoftwareApplication
rangeIncludes: CreativeWork

location
type: Property
equivalent property: isLocatedIn
comment: The location of, for example, where an event is happening, where an organization is located, or where an action takes place.
domainIncludes: InteractionCounter
domainIncludes: Action
domainIncludes: Organization
domainIncludes: Event
rangeIncludes: Text
rangeIncludes: PostalAddress
rangeIncludes: VirtualLocation
rangeIncludes: Place

GeneralContractor
type: Class
comment: A general contractor.
subclass of: HomeAndConstructionBusiness

musicGroupMember
type: Property
comment: A member of a music group—for example, John, Paul, George, or Ringo.
domainIncludes: MusicGroup
rangeIncludes: Person
supersededBy: member

totalPrice
type: Property
comment: The total price for the reservation or ticket, including applicable taxes, shipping, etc.\n\nUsage guidelines:\n\n* Use values from 0123456789 (Unicode 'DIGIT ZERO' (U+0030) to 'DIGIT NINE' (U+0039)) rather than superficially similar Unicode symbols.\n* Use '.' (Unicode 'FULL STOP' (U+002E)) rather than ',' to indicate a decimal point. Avoid using these symbols as a readability separator.
domainIncludes: Reservation
domainIncludes: Ticket
rangeIncludes: PriceSpecification
rangeIncludes: Text
rangeIncludes: Number

MedicineSystem
type: Class
comment: Systems of medical practice.
subclass of: MedicalEnumeration
isPartOf: health-lifesci.schema.org

Female
type: GenderType
comment: The female gender.

gameServer
type: Property
comment: The server on which it is possible to play the game.
domainIncludes: VideoGame
inverseOf: game
rangeIncludes: GameServer

EnergyEfficiencyEnumeration
type: Class
comment: Enumerates energy efficiency levels (also known as "classes" or "ratings") and certifications that are part of several international energy efficiency standards.
subclass of: Enumeration
isPartOf: pending.schema.org
source: https://github.com/schemaorg/schemaorg/issues/2670

asin
type: Property
comment: An Amazon Standard Identification Number (ASIN) is a 10-character alphanumeric unique identifier assigned by Amazon.com and its partners for product identification within the Amazon organization (summary from [Wikipedia](https://en.wikipedia.org/wiki/Amazon_Standard_Identification_Number)'s article). Note also that this is a definition for how to include ASINs in Schema.org data, and not a definition of ASINs in general - see documentation from Amazon for authoritative details. ASINs are most commonly encoded as text strings, but the [asin] property supports URL/URI as potential values too.
sub property of: identifier
domainIncludes: Product
domainIncludes: Offer
domainIncludes: Demand
isPartOf: pending.schema.org
rangeIncludes: Text
rangeIncludes: URL
source: https://github.com/schemaorg/schemaorg/issues/2288

Aquarium
type: Class
comment: Aquarium.
subclass of: CivicStructure

video
type: Property
equivalent property: video
comment: An embedded video object.
domainIncludes: CreativeWork
rangeIncludes: VideoObject
rangeIncludes: Clip

smokingAllowed
type: Property
comment: Indicates whether it is allowed to smoke in the place, e.g. in the restaurant, hotel or hotel room.
contributor: STI Accommodation Ontology
domainIncludes: Place
rangeIncludes: Boolean

email
type: Property
equivalent property: email
comment: Email address.
domainIncludes: ContactPoint
domainIncludes: Organization
domainIncludes: Person
rangeIncludes: Text

Enumeration
type: Class
comment: Lists or enumerations—for example, a list of cuisines or music genres, etc.
subclass of: Intangible

PodcastSeason
type: Class
comment: A single season of a podcast. Many podcasts do not break down into separate seasons. In that case, PodcastSeries should be used.
subclass of: CreativeWorkSeason
isPartOf: pending.schema.org
source: https://github.com/schemaorg/schemaorg/issues/373

applicationCategory
type: Property
comment: Type of software application, e.g. 'Game, Multimedia'.
domainIncludes: SoftwareApplication
rangeIncludes: Text
rangeIncludes: URL

MediaGallery
type: Class
comment: Web page type: Media gallery page. A mixed-media page that can contain media such as images, videos, and other multimedia.
subclass of: CollectionPage

Fungus
type: InfectiousAgentClass
comment: Pathogenic fungus.
isPartOf: health-lifesci.schema.org

broadcastFrequencyValue
type: Property
comment: The frequency in MHz for a particular broadcast.
domainIncludes: BroadcastFrequencySpecification
rangeIncludes: QuantitativeValue
rangeIncludes: Number
source: https://github.com/schemaorg/schemaorg/issues/1004

MemberProgram
type: Class
comment: A MemberProgram defines a loyalty (or membership) program that provides its members with certain benefits, for example better pricing, free shipping or returns, or the ability to earn loyalty points. Member programs may have multiple tiers, for example silver and gold members, each with different benefits.
subclass of: Intangible
isPartOf: pending.schema.org
source: https://github.com/schemaorg/schemaorg/issues/3563

Project
type: Class
comment: An enterprise (potentially individual but typically collaborative), planned to achieve a particular aim. Use properties from Organization, subOrganization/parentOrganization to indicate project sub-structures.
subclass of: Organization
isPartOf: pending.schema.org
source: FundInfoCollab
source: https://github.com/schemaorg/schemaorg/issues/383

attendee
type: Property
comment: A person or organization attending the event.
domainIncludes: Event
rangeIncludes: Organization
rangeIncludes: Person

accessibilityAPI
type: Property
comment: Indicates that the resource is compatible with the referenced accessibility API. Values should be drawn from the [approved vocabulary](https://www.w3.org/2021/a11y-discov-vocab/latest/#accessibilityAPI-vocabulary).
domainIncludes: CreativeWork
rangeIncludes: Text

hasTiers
type: Property
comment: The tiers of a member program.
domainIncludes: MemberProgram
inverseOf: isTierOf
rangeIncludes: MemberProgramTier
source: https://github.com/schemaorg/schemaorg/issues/3563

SoftwareApplication
type: Class
comment: A software application.
subclass of: CreativeWork

aggregateElement
type: Property
comment: Indicates a prototype of the elements in the list that is used to hold aggregate information (ratings, offers, etc.).
domainIncludes: ItemList
isPartOf: pending.schema.org
rangeIncludes: Thing
source: https://github.com/schemaorg/schemaorg/issues/4321

bodyLocation
type: Property
comment: Location in the body of the anatomical structure.
domainIncludes: AnatomicalStructure
domainIncludes: MedicalProcedure
isPartOf: health-lifesci.schema.org
rangeIncludes: Text

OnlineMarketplace
type: Class
comment: An eCommerce marketplace.
subclass of: OnlineStore
isPartOf: pending.schema.org
source: https://github.com/schemaorg/schemaorg/issues/4470

GraphicNovel
type: BookFormatType
comment: This type is deprecated: GraphicNovel does not fit the BookFormatType enumeration, as it can appear in multiple formats (e.g., Hardcover, eBook). It is not mutually exclusive and therefore deprecated. Use standard BookFormatType values instead in combination with the SequentialArt. Book format: GraphicNovel. May represent a bound collection of ComicIssue instances.
isPartOf: bib.schema.org

RestockingFees
type: ReturnFeesEnumeration
comment: Specifies that the customer must pay a restocking fee when returning a product.
isPartOf: pending.schema.org
source: https://github.com/schemaorg/schemaorg/issues/2288

MultiPlayer
type: GamePlayMode
comment: Play mode: MultiPlayer. Requiring or allowing multiple human players to play simultaneously.

numConstraints
type: Property
comment: Indicates the number of constraints property values defined for a particular ConstraintNode such as StatisticalVariable. This helps applications understand if they have access to a sufficiently complete description of a StatisticalVariable or other construct that is defined using properties on template-style nodes.
domainIncludes: ConstraintNode
isPartOf: pending.schema.org
rangeIncludes: Integer
source: https://github.com/schemaorg/schemaorg/issues/2291

comment
type: Property
comment: Comments, typically from users.
domainIncludes: RsvpAction
domainIncludes: CreativeWork
rangeIncludes: Comment

PrependAction
type: Class
comment: The act of inserting at the beginning if an ordered collection.
subclass of: InsertAction

normalRange
type: Property
comment: Range of acceptable values for a typical patient, when applicable.
domainIncludes: MedicalTest
isPartOf: health-lifesci.schema.org
rangeIncludes: MedicalEnumeration
rangeIncludes: Text

copyrightNotice
type: Property
comment: Text of a notice appropriate for describing the copyright aspects of this Creative Work, ideally indicating the owner of the copyright for the Work.
domainIncludes: CreativeWork
isPartOf: pending.schema.org
rangeIncludes: Text
source: https://github.com/schemaorg/schemaorg/issues/2659

FDAcategoryX
type: DrugPregnancyCategory
comment: A designation by the US FDA signifying that studies in animals or humans have demonstrated fetal abnormalities and/or there is positive evidence of human fetal risk based on adverse reaction data from investigational or marketing experience, and the risks involved in use of the drug in pregnant women clearly outweigh potential benefits.
isPartOf: health-lifesci.schema.org

PerformingArtsTheater
type: Class
comment: A theater or other performing art center.
subclass of: CivicStructure

archivedAt
type: Property
comment: Indicates a page or other link involved in archival of a CreativeWork. In the case of MediaReview, the items in a MediaReviewItem may often become inaccessible, but be archived by archival, journalistic, activist, or law enforcement organizations. In such cases, the referenced page may not directly publish the content.
domainIncludes: CreativeWork
isPartOf: pending.schema.org
rangeIncludes: WebPage
rangeIncludes: URL
source: https://github.com/schemaorg/schemaorg/issues/2450

ReturnByMail
type: ReturnMethodEnumeration
comment: Specifies that product returns must be done by mail.
isPartOf: pending.schema.org
source: https://github.com/schemaorg/schemaorg/issues/2880

strengthUnit
type: Property
comment: The units of an active ingredient's strength, e.g. mg.
domainIncludes: DrugStrength
isPartOf: health-lifesci.schema.org
rangeIncludes: Text

birthPlace
type: Property
comment: The place where the person was born.
domainIncludes: Person
rangeIncludes: Place

OverviewHealthAspect
type: HealthAspectEnumeration
comment: Overview of the content. Contains a summarized view of the topic with the most relevant information for an introduction.
isPartOf: pending.schema.org
source: https://github.com/schemaorg/schemaorg/issues/2374

variesBy
type: Property
comment: Indicates the property or properties by which the variants in a ProductGroup vary, e.g. their size, color etc. Schema.org properties can be referenced by their short name e.g. "color"; terms defined elsewhere can be referenced with their URIs.
domainIncludes: ProductGroup
isPartOf: pending.schema.org
rangeIncludes: DefinedTerm
rangeIncludes: Text
source: https://github.com/schemaorg/schemaorg/issues/1797

SheetMusic
type: Class
comment: Printed music, as opposed to performed or recorded music.
subclass of: CreativeWork
isPartOf: pending.schema.org
source: https://github.com/schemaorg/schemaorg/issues/1448

diagnosis
type: Property
comment: One or more alternative conditions considered in the differential diagnosis process as output of a diagnosis process.
domainIncludes: DDxElement
domainIncludes: Patient
isPartOf: health-lifesci.schema.org
rangeIncludes: MedicalCondition

COD
type: PaymentMethodType
comment: Cash on Delivery (COD) payment, equivalent to http://purl.org/goodrelations/v1#COD.

functionalClass
type: Property
comment: The degree of mobility the joint allows.
domainIncludes: Joint
isPartOf: health-lifesci.schema.org
rangeIncludes: MedicalEntity
rangeIncludes: Text

DENonprofitType
type: Class
comment: DENonprofitType: Non-profit organization type originating from Germany in accordance with article 52 of the German fiscal code (Abgabenverordnung or AO).
subclass of: NonprofitType
isPartOf: pending.schema.org
source: https://github.com/schemaorg/schemaorg/issues/3629

auditDate
type: Property
equivalent property: InspectionDateTime
comment: Date when a certification was last audited. See also [gs1:certificationAuditDate](https://www.gs1.org/voc/certificationAuditDate).
domainIncludes: Certification
rangeIncludes: Date
rangeIncludes: DateTime
source: https://github.com/schemaorg/schemaorg/issues/3230

regionDrained
type: Property
comment: The anatomical or organ system drained by this vessel; generally refers to a specific part of an organ.
domainIncludes: Vein
domainIncludes: LymphaticVessel
isPartOf: health-lifesci.schema.org
rangeIncludes: AnatomicalSystem
rangeIncludes: AnatomicalStructure

knowsLanguage
type: Property
comment: Of a Person, and less typically of an Organization, to indicate a known language. We do not distinguish skill levels or reading/writing/speaking/signing here. Use language codes from the [IETF BCP 47 standard](http://tools.ietf.org/html/bcp47).
contributor: TP
domainIncludes: Organization
domainIncludes: Person
isPartOf: pending.schema.org
rangeIncludes: Text
rangeIncludes: Language
source: https://github.com/schemaorg/schemaorg/issues/1688

schoolClosuresInfo
type: Property
comment: Information about school closures.
domainIncludes: SpecialAnnouncement
isPartOf: pending.schema.org
rangeIncludes: WebContent
rangeIncludes: URL
source: https://github.com/schemaorg/schemaorg/issues/2490

servingSize
type: Property
comment: The serving size, in terms of the number of volume or mass.
domainIncludes: NutritionInformation
rangeIncludes: Text

CertificationActive
type: CertificationStatusEnumeration
comment: Specifies that a certification is active.
isPartOf: pending.schema.org
source: https://github.com/schemaorg/schemaorg/issues/3230

Season
type: Class
comment: A media season, e.g. TV, radio, video game etc.
subclass of: CreativeWork
supersededBy: CreativeWorkSeason

sdDatePublished
type: Property
comment: Indicates the date on which the current structured data was generated / published. Typically used alongside sdPublisher.
domainIncludes: CreativeWork
isPartOf: pending.schema.org
rangeIncludes: Date
source: https://github.com/schemaorg/schemaorg/issues/1886

ReturnAction
type: Class
comment: The act of returning to the origin that which was previously received (concrete objects) or taken (ownership).
subclass of: TransferAction

ProgramMembership
type: Class
comment: Used to describe membership in a loyalty programs (e.g. "StarAliance"), traveler clubs (e.g. "AAA"), purchase clubs ("Safeway Club"), etc.
subclass of: Intangible

cvdNumC19OverflowPats
type: Property
comment: numc19overflowpats - ED/OVERFLOW: Patients with suspected or confirmed COVID-19 who are in the ED or any overflow location awaiting an inpatient bed.
domainIncludes: CDCPMDRecord
isPartOf: pending.schema.org
rangeIncludes: Number
source: https://github.com/schemaorg/schemaorg/issues/2521

thumbnailUrl
type: Property
comment: A thumbnail image relevant to the Thing.
domainIncludes: CreativeWork
rangeIncludes: URL

hasDeliveryMethod
type: Property
comment: Method used for delivery or shipping.
domainIncludes: ParcelDelivery
domainIncludes: DeliveryEvent
rangeIncludes: DeliveryMethod

loanPaymentFrequency
type: Property
comment: Frequency of payments due, i.e. number of months between payments. This is defined as a frequency, i.e. the reciprocal of a period of time.
contributor: FIBO
domainIncludes: RepaymentSpecification
isPartOf: pending.schema.org
rangeIncludes: Number
source: https://github.com/schemaorg/schemaorg/issues/1253

hasCredential
type: Property
comment: A credential awarded to the Person or Organization.
domainIncludes: Organization
domainIncludes: Person
isPartOf: pending.schema.org
rangeIncludes: Credential
source: https://github.com/schemaorg/schemaorg/issues/2289

SalePrice
type: PriceTypeEnumeration
comment: Represents a sale price (usually active for a limited period) of an offered product.
isPartOf: pending.schema.org
source: https://github.com/schemaorg/schemaorg/issues/2712

Review
type: Class
comment: A review of an item - for example, of a restaurant, movie, or store.
subclass of: CreativeWork

GovernmentPermit
type: Class
comment: A permit issued by a government agency.
subclass of: Permit

locationCreated
type: Property
comment: The location where the CreativeWork was created, which may not be the same as the location depicted in the CreativeWork.
domainIncludes: CreativeWork
rangeIncludes: Place

MedicalRiskEstimator
type: Class
comment: Any rule set or interactive tool for estimating the risk of developing a complication or condition.
subclass of: MedicalEntity
isPartOf: health-lifesci.schema.org

monthlyMinimumRepaymentAmount
type: Property
comment: The minimum payment is the lowest amount of money that one is required to pay on a credit card statement each month.
contributor: FIBO
domainIncludes: PaymentCard
isPartOf: pending.schema.org
rangeIncludes: MonetaryAmount
rangeIncludes: Number
source: https://github.com/schemaorg/schemaorg/issues/1253

significance
type: Property
comment: The significance associated with the superficial anatomy; as an example, how characteristics of the superficial anatomy can suggest underlying medical conditions or courses of treatment.
domainIncludes: SuperficialAnatomy
isPartOf: health-lifesci.schema.org
rangeIncludes: Text

season
type: Property
comment: A season in a media series.
sub property of: hasPart
domainIncludes: RadioSeries
domainIncludes: TVSeries
domainIncludes: VideoGameSeries
rangeIncludes: URL
rangeIncludes: CreativeWorkSeason
supersededBy: containsSeason

MedicalObservationalStudyDesign
type: Class
comment: Design models for observational medical studies. Enumerated type.
subclass of: MedicalEnumeration
isPartOf: health-lifesci.schema.org

muscleAction
type: Property
comment: The movement the muscle generates.
domainIncludes: Muscle
isPartOf: health-lifesci.schema.org
rangeIncludes: Text

longitude
type: Property
comment: The longitude of a location. For example ```-122.08585``` ([WGS 84](https://en.wikipedia.org/wiki/World_Geodetic_System)).
sub property of: hasLongitude
domainIncludes: GeoCoordinates
domainIncludes: Place
rangeIncludes: Text
rangeIncludes: Number

lodgingUnitDescription
type: Property
comment: A full description of the lodging unit.
domainIncludes: LodgingReservation
rangeIncludes: Text

commentTime
type: Property
comment: The time at which the UserComment was made.
domainIncludes: UserComments
rangeIncludes: DateTime
rangeIncludes: Date

ChooseAction
type: Class
comment: The act of expressing a preference from a set of options or a large or unbounded set of choices/options.
subclass of: AssessAction

acquireLicensePage
type: Property
comment: Indicates a page documenting how licenses can be purchased or otherwise acquired, for the current item.
sub property of: usageInfo
domainIncludes: CreativeWork
isPartOf: pending.schema.org
rangeIncludes: CreativeWork
rangeIncludes: URL
source: https://github.com/schemaorg/schemaorg/issues/2454

GasStation
type: Class
comment: A gas station.
subclass of: AutomotiveBusiness

ActivationFee
type: PriceComponentTypeEnumeration
comment: Represents the activation fee part of the total price for an offered product, for example a cellphone contract.
isPartOf: pending.schema.org
source: https://github.com/schemaorg/schemaorg/issues/2689

clipNumber
type: Property
comment: Position of the clip within an ordered group of clips.
sub property of: position
domainIncludes: Clip
rangeIncludes: Text
rangeIncludes: Integer

predecessorOf
type: Property
comment: A pointer from a previous, often discontinued variant of the product to its newer variant.
contributor: GoodRelationsTerms
domainIncludes: ProductModel
rangeIncludes: ProductModel

lowPrice
type: Property
comment: The lowest price of all offers available.\n\nUsage guidelines:\n\n* Use values from 0123456789 (Unicode 'DIGIT ZERO' (U+0030) to 'DIGIT NINE' (U+0039)) rather than superficially similar Unicode symbols.\n* Use '.' (Unicode 'FULL STOP' (U+002E)) rather than ',' to indicate a decimal point. Avoid using these symbols as a readability separator.
sub property of: hasLowerBound
sub property of: hasMonetaryAmount
domainIncludes: AggregateOffer
rangeIncludes: Text
rangeIncludes: Number

IgnoreAction
type: Class
comment: The act of intentionally disregarding the object. An agent ignores an object.
subclass of: AssessAction

MediaSubscription
type: Class
comment: A subscription which allows a user to access media including audio, video, books, etc.
subclass of: Intangible
source: https://github.com/schemaorg/schemaorg/issues/1741

PrescriptionOnly
type: DrugPrescriptionStatus
comment: Available by prescription only.
isPartOf: health-lifesci.schema.org

BuddhistTemple
type: Class
comment: A Buddhist temple.
subclass of: PlaceOfWorship

taxonRank
type: Property
comment: The taxonomic rank of this taxon given preferably as a URI from a controlled vocabulary – typically the ranks from TDWG TaxonRank ontology or equivalent Wikidata URIs.
domainIncludes: Taxon
isPartOf: pending.schema.org
rangeIncludes: URL
rangeIncludes: PropertyValue
rangeIncludes: Text
source: Taxon

Painting
type: Class
comment: A painting.
subclass of: CreativeWork

OfflineTemporarily
type: GameServerStatus
comment: Game server status: OfflineTemporarily. Server is offline now but it can be online soon.

toLocation
type: Property
comment: A sub property of location. The final location of the object or the agent after the action.
sub property of: location
domainIncludes: MoveAction
domainIncludes: TransferAction
domainIncludes: ExerciseAction
domainIncludes: InsertAction
rangeIncludes: Place

PropertyValue
type: Class
comment: A property-value pair, e.g. representing a feature of a product or place. Use the 'name' property for the name of the property. If there is an additional human-readable version of the value, put that into the 'description' property.\n\n Always use specific schema.org properties when a) they exist and b) you can populate them. Using PropertyValue as a substitute will typically not trigger the same effect as using the original, specific property.
subclass of: StructuredValue
contributor: good-relations-and-schema-org

UpdateAction
type: Class
comment: The act of managing by changing/editing the state of the object.
subclass of: Action

broadcastSubChannel
type: Property
comment: The subchannel used for the broadcast.
domainIncludes: BroadcastFrequencySpecification
isPartOf: pending.schema.org
rangeIncludes: Text
source: https://github.com/schemaorg/schemaorg/issues/2111

Optometric
type: MedicalSpecialty
comment: The science or practice of testing visual acuity and prescribing corrective lenses.
subclass of: MedicalBusiness
isPartOf: health-lifesci.schema.org

copyrightYear
type: Property
comment: The year during which the claimed copyright for the CreativeWork was first asserted.
domainIncludes: CreativeWork
rangeIncludes: Number

Airport
type: Class
comment: An airport.
subclass of: CivicStructure

contactPoint
type: Property
equivalent property: contactPoint
equivalent property: hasContactPoint
comment: A contact point for a person or organization.
domainIncludes: HealthInsurancePlan
domainIncludes: Organization
domainIncludes: Person
rangeIncludes: ContactPoint

review
type: Property
comment: A review of the item.
domainIncludes: Brand
domainIncludes: Offer
domainIncludes: Place
domainIncludes: Organization
domainIncludes: Event
domainIncludes: Service
domainIncludes: CreativeWork
domainIncludes: Product
rangeIncludes: Review

KosherDiet
type: RestrictedDiet
comment: A diet conforming to Jewish dietary practices.

Conversation
type: Class
comment: One or more messages between organizations or people on a particular topic. Individual messages can be linked to the conversation with isPartOf or hasPart properties.
subclass of: CreativeWork

Action
type: Class
comment: An action performed by a direct agent and indirect participants upon a direct object. Optionally happens at a location with the help of an inanimate instrument. The execution of the action may produce a result. Specific action sub-type documentation specifies the exact expectation of each argument/role.\n\nSee also [blog post](https://blog.schema.org/2014/04/16/announcing-schema-org-actions/) and [Actions overview document](https://schema.org/docs/actions.html).
subclass of: Thing
contributor: ActionCollabClass

MemberProgramTier
type: Class
comment: A MemberProgramTier specifies a tier under a loyalty (member) program, for example "gold".
subclass of: Intangible
isPartOf: pending.schema.org
source: https://github.com/schemaorg/schemaorg/issues/3563

increasesRiskOf
type: Property
comment: The condition, complication, etc. influenced by this factor.
domainIncludes: MedicalRiskFactor
isPartOf: health-lifesci.schema.org
rangeIncludes: MedicalEntity

containedIn
type: Property
comment: The basic containment relation between a place and one that contains it.
domainIncludes: Place
rangeIncludes: Place
supersededBy: containedInPlace

shippingConditions
type: Property
comment: The conditions (constraints, price) applicable to the ShippingService.
domainIncludes: ShippingService
isPartOf: pending.schema.org
rangeIncludes: ShippingConditions
source: https://github.com/schemaorg/schemaorg/issues/3617

MensClothingStore
type: Class
comment: A men's clothing store.
subclass of: Store

eventAttendanceMode
type: Property
comment: The eventAttendanceMode of an event indicates whether it occurs online, offline, or a mix.
domainIncludes: Event
isPartOf: pending.schema.org
rangeIncludes: EventAttendanceModeEnumeration
source: https://github.com/schemaorg/schemaorg/issues/1842

maximumVirtualAttendeeCapacity
type: Property
comment: The maximum virtual attendee capacity of an Event whose eventAttendanceMode is OnlineEventAttendanceMode (or the online aspects, in the case of a MixedEventAttendanceMode).
domainIncludes: Event
isPartOf: pending.schema.org
rangeIncludes: Integer
source: https://github.com/schemaorg/schemaorg/issues/1842

paymentUrl
type: Property
comment: The URL for sending a payment.
sub property of: hasAddress
domainIncludes: Order
rangeIncludes: URL

additionalVariable
type: Property
comment: Any additional component of the exercise prescription that may need to be articulated to the patient. This may include the order of exercises, the number of repetitions of movement, quantitative distance, progressions over time, etc.
domainIncludes: ExercisePlan
isPartOf: health-lifesci.schema.org
rangeIncludes: Text

subEvent
type: Property
comment: An Event that is part of this event. For example, a conference event includes many presentations, each of which is a subEvent of the conference.
domainIncludes: Event
inverseOf: superEvent
rangeIncludes: Event

availableTest
type: Property
comment: A diagnostic test or procedure offered by this lab.
domainIncludes: DiagnosticLab
isPartOf: health-lifesci.schema.org
rangeIncludes: MedicalTest

Airline
type: Class
comment: An organization that provides flights for passengers.
subclass of: Organization

healthPlanCoinsuranceOption
type: Property
comment: Whether the coinsurance applies before or after deductible, etc. TODO: Is this a closed set?
domainIncludes: HealthPlanCostSharingSpecification
isPartOf: pending.schema.org
rangeIncludes: Text
source: https://github.com/schemaorg/schemaorg/issues/1062

BuyAction
type: Class
comment: The act of giving money to a seller in exchange for goods or services rendered. An agent buys an object, product, or service from a seller for a price. Reciprocal of SellAction.
subclass of: TradeAction

hasVariant
type: Property
comment: Indicates a Product that is a member of this ProductGroup (or ProductModel).
domainIncludes: ProductGroup
inverseOf: isVariantOf
isPartOf: pending.schema.org
rangeIncludes: Product
source: https://github.com/schemaorg/schemaorg/issues/1797

publication
type: Property
comment: A publication event associated with the item.
domainIncludes: CreativeWork
rangeIncludes: PublicationEvent

duplicateTherapy
type: Property
comment: A therapy that duplicates or overlaps this one.
domainIncludes: MedicalTherapy
isPartOf: health-lifesci.schema.org
rangeIncludes: MedicalTherapy

Nonprofit501n
type: USNonprofitType
comment: Nonprofit501n: Non-profit type referring to Charitable Risk Pools.
isPartOf: pending.schema.org
source: https://github.com/schemaorg/schemaorg/issues/2543

InvestmentOrDeposit
type: Class
comment: A type of financial product that typically requires the client to transfer funds to a financial service in return for potential beneficial financial return.
subclass of: FinancialProduct
contributor: FIBO

GatedResidenceCommunity
type: Class
comment: Residence type: Gated community.
subclass of: Residence

bestRating
type: Property
comment: The highest value allowed in this rating system.
domainIncludes: Rating
rangeIncludes: Text
rangeIncludes: Number

StadiumOrArena
type: Class
comment: A stadium.
subclass of: CivicStructure
subclass of: SportsActivityLocation

recourseLoan
type: Property
comment: The only way you get the money back in the event of default is the security. Recourse is where you still have the opportunity to go back to the borrower for the rest of the money.
contributor: FIBO
domainIncludes: LoanOrCredit
isPartOf: pending.schema.org
rangeIncludes: Boolean
source: https://github.com/schemaorg/schemaorg/issues/1253

TransformedContent
type: MediaManipulationRatingEnumeration
comment: Content coded 'transformed content' in a MediaReview, considered in the context of how it was published or shared. For a VideoObject to be 'transformed content': or all of the video has been manipulated to transform the footage itself. This category includes using tools like the Adobe Suite to change the speed of the video, add or remove visual elements or dub audio. Deepfakes are also a subset of transformation. For an ImageObject to be 'transformed content': Adding or deleting visual elements to give the image a different meaning with the intention to mislead. For an ImageObject with embedded text to be 'transformed content': Adding or deleting visual elements to give the image a different meaning with the intention to mislead. For an AudioObject to be 'transformed content': Part or all of the audio has been manipulated to alter the words or sounds, or the audio has been synthetically generated, such as to create a sound-alike voice.
isPartOf: pending.schema.org
source: https://github.com/schemaorg/schemaorg/issues/2450

fromLocation
type: Property
comment: A sub property of location. The original location of the object or the agent before the action.
sub property of: location
domainIncludes: MoveAction
domainIncludes: TransferAction
domainIncludes: ExerciseAction
rangeIncludes: Place

encodesBioChemEntity
type: Property
comment: Another BioChemEntity encoded by this one.
domainIncludes: Gene
inverseOf: isEncodedByBioChemEntity
isPartOf: pending.schema.org
rangeIncludes: BioChemEntity
source: Gene

isFamilyFriendly
type: Property
comment: Indicates whether this content is family friendly.
domainIncludes: Offer
domainIncludes: CreativeWork
domainIncludes: Product
rangeIncludes: Boolean

returnPolicyCountry
type: Property
comment: The country where the product has to be sent to for returns, for example "Ireland" using the name property of Country. You can also provide the two-letter [ISO 3166-1 alpha-2 country code](http://en.wikipedia.org/wiki/ISO_3166-1). Note that this can be different from the country where the product was originally shipped from or sent to.
domainIncludes: MerchantReturnPolicy
isPartOf: pending.schema.org
rangeIncludes: Country
rangeIncludes: Text
source: https://github.com/schemaorg/schemaorg/issues/2880

OrderPickupAvailable
type: OrderStatus
comment: OrderStatus representing availability of an order for pickup.

jobLocation
type: Property
comment: A (typically single) geographic location associated with the job position.
domainIncludes: JobPosting
rangeIncludes: Place

UsedCondition
type: OfferItemCondition
comment: Indicates that the item is used.

valueMinLength
type: Property
comment: Specifies the minimum allowed range for number of characters in a literal value.
domainIncludes: PropertyValueSpecification
rangeIncludes: Number

RentalVehicleUsage
type: CarUsageType
comment: Indicates the usage of the vehicle as a rental car.
contributor: Automotive Ontology Working Group
isPartOf: auto.schema.org

referenceQuantity
type: Property
comment: The reference quantity for which a certain price applies, e.g. 1 EUR per 4 kWh of electricity. This property is a replacement for unitOfMeasurement for the advanced cases where the price does not relate to a standard unit.
contributor: GoodRelationsTerms
domainIncludes: UnitPriceSpecification
rangeIncludes: QuantitativeValue

childTaxon
type: Property
comment: Closest child taxa of the taxon in question.
domainIncludes: Taxon
inverseOf: parentTaxon
isPartOf: pending.schema.org
rangeIncludes: Taxon
rangeIncludes: Text
rangeIncludes: URL
source: Taxon

ratingExplanation
type: Property
comment: A short explanation (e.g. one to two sentences) providing background context and other information that led to the conclusion expressed in the rating. This is particularly applicable to ratings associated with "fact check" markup using ClaimReview.
domainIncludes: Rating
isPartOf: pending.schema.org
rangeIncludes: Text
source: https://github.com/schemaorg/schemaorg/issues/2300

MovieClip
type: Class
comment: A short segment/part of a movie.
subclass of: Clip

additionalType
type: Property
comment: An additional type for the item, typically used for adding more specific types from external vocabularies in microdata syntax. This is a relationship between something and a class that the thing is in. Typically the value is a URI-identified RDF class, and in this case corresponds to the use of rdf:type in RDF. Text values can be used sparingly, for cases where useful information can be added without their being an appropriate schema to reference. In the case of text values, the class label should follow the schema.org style guide.
sub property of: type
domainIncludes: Thing
rangeIncludes: Text
rangeIncludes: URL

tourBookingPage
type: Property
comment: A page providing information on how to book a tour of some Place, such as an Accommodation or ApartmentComplex in a real estate setting, as well as other kinds of tours as appropriate.
domainIncludes: Accommodation
domainIncludes: Place
domainIncludes: ApartmentComplex
isPartOf: pending.schema.org
rangeIncludes: URL
source: https://github.com/schemaorg/schemaorg/issues/2373

Order
type: Class
equivalent class: Order
comment: An order is a confirmation of a transaction (a receipt), which can contain multiple line items, each represented by an Offer that has been accepted by the customer.
subclass of: LegalDocument
subclass of: Intangible

AlbumRelease
type: MusicAlbumReleaseType
comment: AlbumRelease.
contributor: MBZ

sender
type: Property
comment: A sub property of participant. The participant who is at the sending end of the action.
sub property of: participant
domainIncludes: ReceiveAction
domainIncludes: Message
rangeIncludes: Organization
rangeIncludes: Person
rangeIncludes: Audience

isUnlabelledFallback
type: Property
comment: This can be marked 'true' to indicate that some published DeliveryTimeSettings or ShippingRateSettings are intended to apply to all OfferShippingDetails published by the same merchant, when referenced by a shippingSettingsLink in those settings. It is not meaningful to use a 'true' value for this property alongside a transitTimeLabel (for DeliveryTimeSettings) or shippingLabel (for ShippingRateSettings), since this property is for use with unlabelled settings.
domainIncludes: DeliveryTimeSettings
domainIncludes: ShippingRateSettings
rangeIncludes: Boolean
source: https://github.com/schemaorg/schemaorg/issues/2506

WearableSizeGroupExtraTall
type: WearableSizeGroupEnumeration
comment: Size group "Extra Tall" for wearables.
isPartOf: pending.schema.org
source: https://github.com/schemaorg/schemaorg/issues/2811

track
type: Property
comment: A music recording (track)—usually a single song. If an ItemList is given, the list should contain items of type MusicRecording.
contributor: MBZ
domainIncludes: MusicPlaylist
domainIncludes: MusicGroup
rangeIncludes: ItemList
rangeIncludes: MusicRecording

pregnancyCategory
type: Property
comment: Pregnancy category of this drug.
domainIncludes: Drug
isPartOf: health-lifesci.schema.org
rangeIncludes: DrugPregnancyCategory

hasCertification
type: Property
equivalent property: ApplicableCertificate
comment: Certification information about a product, organization, service, place, or person.
sub property of: isClassifiedBy
sub property of: isReferencedIn
domainIncludes: Person
domainIncludes: Product
domainIncludes: Service
domainIncludes: Place
domainIncludes: Organization
rangeIncludes: Certification
source: https://github.com/schemaorg/schemaorg/issues/3230

correction
type: Property
comment: Indicates a correction to a CreativeWork, either via a CorrectionComment, textually or in another document.
contributor: TP
domainIncludes: CreativeWork
isPartOf: pending.schema.org
rangeIncludes: CorrectionComment
rangeIncludes: Text
rangeIncludes: URL
source: https://github.com/schemaorg/schemaorg/issues/1950

ProfilePage
type: Class
comment: Web page type: Profile page.
subclass of: WebPage

interactionType
type: Property
comment: The Action representing the type of interaction. For up votes, +1s, etc. use LikeAction. For down votes use DislikeAction. Otherwise, use the most specific Action.
domainIncludes: InteractionCounter
rangeIncludes: Action

DDxElement
type: Class
comment: An alternative, closely-related condition typically considered later in the differential diagnosis process along with the signs that are used to distinguish it.
subclass of: MedicalIntangible
isPartOf: health-lifesci.schema.org

producer
type: Property
comment: The person or organization who produced the work (e.g. music album, movie, TV/radio series etc.).
domainIncludes: CreativeWork
rangeIncludes: Organization
rangeIncludes: Person

gtin13
type: Property
comment: The GTIN-13 code of the product, or the product to which the offer refers. This is equivalent to 13-digit ISBN codes and EAN UCC-13. Former 12-digit UPC codes can be converted into a GTIN-13 code by simply adding a preceding zero. See [GS1 GTIN Summary](http://www.gs1.org/barcodes/technical/idkeys/gtin) for more details.
sub property of: gtin
sub property of: identifier
contributor: GoodRelationsTerms
domainIncludes: Product
domainIncludes: Offer
domainIncludes: Demand
rangeIncludes: Text

SpeechPathology
type: MedicalSpecialty
comment: The scientific study and treatment of defects, disorders, and malfunctions of speech and voice, as stuttering, lisping, or lalling, and of language disturbances, as aphasia or delayed language acquisition.
isPartOf: health-lifesci.schema.org

orderValue
type: Property
comment: Minimum and maximum order value for which these shipping conditions are valid.
domainIncludes: ShippingConditions
isPartOf: pending.schema.org
rangeIncludes: MonetaryAmount
source: https://github.com/schemaorg/schemaorg/issues/3617

DiagnosticLab
type: Class
comment: A medical laboratory that offers on-site or off-site diagnostic services.
subclass of: MedicalOrganization
isPartOf: health-lifesci.schema.org

unitText
type: Property
comment: A string or text indicating the unit of measurement. Useful if you cannot provide a standard unit code for unitCode.
domainIncludes: PropertyValue
domainIncludes: TypeAndQuantityNode
domainIncludes: UnitPriceSpecification
domainIncludes: QuantitativeValue
rangeIncludes: Text

drugUnit
type: Property
comment: The unit in which the drug is measured, e.g. '5 mg tablet'.
domainIncludes: Drug
domainIncludes: DrugCost
isPartOf: health-lifesci.schema.org
rangeIncludes: Text

ticketNumber
type: Property
comment: The unique identifier for the ticket.
domainIncludes: Ticket
rangeIncludes: Text

PeopleAudience
type: Class
comment: A set of characteristics belonging to people, e.g. who compose an item's target audience.
subclass of: Audience

Series
type: Class
comment: A Series in schema.org is a group of related items, typically but not necessarily of the same kind. See also CreativeWorkSeries, EventSeries.
subclass of: Intangible

BreadcrumbList
type: Class
comment: A BreadcrumbList is an ItemList consisting of a chain of linked Web pages, typically described using at least their URL and their name, and typically ending with the current page.\n\nThe position property is used to reconstruct the order of the items in a BreadcrumbList. The convention is that a breadcrumb list has an itemListOrder of ItemListOrderAscending (lower values listed first), and that the first items in this list correspond to the "top" or beginning of the breadcrumb trail, e.g. with a site or section homepage. The specific values of 'position' are not assigned meaning for a BreadcrumbList, but they should be integers, e.g. beginning with '1' for the first item in the list.
subclass of: ItemList

postalCodeRange
type: Property
comment: A defined range of postal codes.
domainIncludes: DefinedRegion
rangeIncludes: PostalCodeRangeSpecification
source: https://github.com/schemaorg/schemaorg/issues/2506

DeleteAction
type: Class
comment: The act of editing a recipient by removing one of its objects.
subclass of: UpdateAction

repetitions
type: Property
comment: Number of times one should repeat the activity.
domainIncludes: ExercisePlan
isPartOf: health-lifesci.schema.org
rangeIncludes: Number
rangeIncludes: QuantitativeValue

Tuesday
type: DayOfWeek
comment: The day of the week between Monday and Wednesday.

Demand
type: Class
equivalent class: RequestForQuotation
comment: A demand entity represents the public, not necessarily binding, not necessarily exclusive, announcement by an organization or person to seek a certain type of goods or services. For describing demand using this type, the very same properties used for Offer apply.
subclass of: Intangible
contributor: good-relations-and-schema-org

guidelineSubject
type: Property
comment: The medical conditions, treatments, etc. that are the subject of the guideline.
domainIncludes: MedicalGuideline
isPartOf: health-lifesci.schema.org
rangeIncludes: MedicalEntity

BusReservation
type: Class
comment: A reservation for bus travel. \n\nNote: This type is for information about actual reservations, e.g. in confirmation emails or HTML pages with individual confirmations of reservations. For offers of tickets, use Offer.
subclass of: Reservation

cssSelector
type: Property
comment: A CSS selector, e.g. of a SpeakableSpecification or WebPageElement. In the latter case, multiple matches within a page can constitute a single conceptual "Web page element".
domainIncludes: WebPageElement
domainIncludes: SpeakableSpecification
rangeIncludes: CssSelectorType
source: https://github.com/schemaorg/schemaorg/issues/1389

ScheduleAction
type: Class
comment: Scheduling future actions, events, or tasks.\n\nRelated actions:\n\n* ReserveAction: Unlike ReserveAction, ScheduleAction allocates future actions (e.g. an event, a task, etc) towards a time slot / spatial allocation.
subclass of: PlanAction

workFeatured
type: Property
comment: A work featured in some event, e.g. exhibited in an ExhibitionEvent. Specific subproperties are available for workPerformed (e.g. a play), or a workPresented (a Movie at a ScreeningEvent).
domainIncludes: Event
rangeIncludes: CreativeWork

iataCode
type: Property
comment: IATA identifier for an airline or airport.
domainIncludes: Airline
domainIncludes: Airport
rangeIncludes: Text

OrderCancelled
type: OrderStatus
comment: OrderStatus representing cancellation of an order.

Reservation
type: Class
comment: Describes a reservation for travel, dining or an event. Some reservations require tickets. \n\nNote: This type is for information about actual reservations, e.g. in confirmation emails or HTML pages with individual confirmations of reservations. For offers of tickets, restaurant reservations, flights, or rental cars, use Offer.
subclass of: Intangible

EffectivenessHealthAspect
type: HealthAspectEnumeration
comment: Content about the effectiveness-related aspects of a health topic.
isPartOf: pending.schema.org
source: https://github.com/schemaorg/schemaorg/issues/2799

DamagedCondition
type: OfferItemCondition
comment: Indicates that the item is damaged.

OriginalShippingFees
type: ReturnFeesEnumeration
comment: Specifies that the customer must pay the original shipping costs when returning a product.
isPartOf: pending.schema.org
source: https://github.com/schemaorg/schemaorg/issues/2288

Offer
type: Class
equivalent class: Offer
comment: An offer to transfer some rights to an item or to provide a service — for example, an offer to sell tickets to an event, to rent the DVD of a movie, to stream a TV show over the internet, to repair a motorcycle, or to loan a book.\n\nNote: As the businessFunction property, which identifies the form of offer (e.g. sell, lease, repair, dispose), defaults to http://purl.org/goodrelations/v1#Sell; an Offer without a defined businessFunction value can be assumed to be an offer to sell.\n\nFor [GTIN](http://www.gs1.org/barcodes/technical/idkeys/gtin)-related fields, see [Check Digit calculator](http://www.gs1.org/barcodes/support/check_digit_calculator) and [validation guide](http://www.gs1us.org/resources/standards/gtin-validation-guide) from [GS1](http://www.gs1.org/).
subclass of: Intangible
contributor: GoodRelationsTerms

WPAdBlock
type: Class
comment: An advertising section of the page.
subclass of: WebPageElement

Physician
type: Class
comment: An individual physician or a physician's office considered as a MedicalOrganization.
subclass of: MedicalBusiness
subclass of: MedicalOrganization

rsvpResponse
type: Property
comment: The response (yes, no, maybe) to the RSVP.
domainIncludes: RsvpAction
rangeIncludes: RsvpResponseType

FoodEvent
type: Class
comment: Event type: Food event.
subclass of: Event

TouristAttraction
type: Class
comment: A tourist attraction. In principle any Thing can be a TouristAttraction, from a Mountain and LandmarksOrHistoricalBuildings to a LocalBusiness. This Type can be used on its own to describe a general TouristAttraction, or be used as an additionalType to add tourist attraction properties to any other type. (See examples below)
subclass of: Place
contributor: IIT-CNR.it
contributor: Tourism

disambiguatingDescription
type: Property
comment: A sub property of description. A short description of the item used to disambiguate from other, similar items. Information from other properties (in particular, name) may be necessary for the description to be useful for disambiguation.
sub property of: description
domainIncludes: Thing
rangeIncludes: Text

WearableSizeSystemEnumeration
type: Class
comment: Enumerates common size systems specific for wearable products.
subclass of: SizeSystemEnumeration
isPartOf: pending.schema.org
source: https://github.com/schemaorg/schemaorg/issues/2811

playersOnline
type: Property
comment: Number of players on the server.
domainIncludes: GameServer
rangeIncludes: Integer

ReviewNewsArticle
type: Class
comment: A NewsArticle and CriticReview providing a professional critic's assessment of a service, product, performance, or artistic or literary work.
subclass of: CriticReview
subclass of: NewsArticle
contributor: TP
isPartOf: pending.schema.org
source: https://github.com/schemaorg/schemaorg/issues/1525

Drawing
type: Class
comment: A picture or diagram made with a pencil, pen, or crayon rather than paint.
subclass of: CreativeWork
isPartOf: pending.schema.org
source: https://github.com/schemaorg/schemaorg/issues/1448

breadcrumb
type: Property
comment: A set of links that can help a user understand and navigate a website hierarchy.
domainIncludes: WebPage
rangeIncludes: Text
rangeIncludes: BreadcrumbList

actionProcess
type: Property
comment: Description of the process by which the action was performed.
domainIncludes: Action
rangeIncludes: HowTo

Wednesday
type: DayOfWeek
comment: The day of the week between Tuesday and Thursday.

ITSocialCompanyCharity
type: ITNonprofitType
comment: ITSocialCompanyCharity: Non-profit type referring to companies with charitable missions (Ital. Imprese Sociali or IS) according to Italian Law 112 of 2017.
isPartOf: pending.schema.org
source: https://github.com/schemaorg/schemaorg/issues/3629

RadioClip
type: Class
comment: A short radio program or a segment/part of a radio program.
subclass of: Clip

countriesNotSupported
type: Property
comment: Countries for which the application is not supported. You can also provide the two-letter ISO 3166-1 alpha-2 country code.
domainIncludes: SoftwareApplication
rangeIncludes: Text

BenefitsHealthAspect
type: HealthAspectEnumeration
comment: Content about the benefits and advantages of usage or utilization of topic.
isPartOf: pending.schema.org
source: https://github.com/schemaorg/schemaorg/issues/2374

Duration
type: Class
equivalent class: Duration
comment: Quantity: Duration (use [ISO 8601 duration format](http://en.wikipedia.org/wiki/ISO_8601)).
subclass of: Quantity

maintainer
type: Property
comment: A maintainer of a Dataset, software package (SoftwareApplication), or other Project. A maintainer is a Person or Organization that manages contributions to, and/or publication of, some (typically complex) artifact. It is common for distributions of software and data to be based on "upstream" sources. When maintainer is applied to a specific version of something e.g. a particular version or packaging of a Dataset, it is always possible that the upstream source has a different maintainer. The isBasedOn property can be used to indicate such relationships between datasets to make the different maintenance roles clear. Similarly in the case of software, a package may have dedicated maintainers working on integration into software distributions such as Ubuntu, as well as upstream maintainers of the underlying work.
domainIncludes: CreativeWork
isPartOf: pending.schema.org
rangeIncludes: Organization
rangeIncludes: Person
source: https://github.com/schemaorg/schemaorg/issues/2311

bankAccountType
type: Property
comment: The type of a bank account.
contributor: FIBO
domainIncludes: BankAccount
isPartOf: pending.schema.org
rangeIncludes: Text
rangeIncludes: URL
source: https://github.com/schemaorg/schemaorg/issues/1253

ProductGroup
type: Class
comment: A ProductGroup represents a group of Products that vary only in certain well-described ways, such as by size, color, material etc. While a ProductGroup itself is not directly offered for sale, the various varying products that it represents can be. The ProductGroup serves as a prototype or template, standing in for all of the products who have an isVariantOf relationship to it. As such, properties (including additional types) can be applied to the ProductGroup to represent characteristics shared by each of the (possibly very many) variants. Properties that reference a ProductGroup are not included in this mechanism; neither are the following specific properties variesBy, hasVariant, url.
subclass of: Product
subclass of: Collection
subclass of: Classifier
isPartOf: pending.schema.org
source: https://github.com/schemaorg/schemaorg/issues/1797

stage
type: Property
comment: The stage of the condition, if applicable.
domainIncludes: MedicalCondition
isPartOf: health-lifesci.schema.org
rangeIncludes: MedicalConditionStage

vatID
type: Property
comment: The value-added Tax ID of the organization or person with national prefix (for example IT123456789). Can also be described as iso6523Code with proper prefix.
contributor: GoodRelationsTerms
domainIncludes: Organization
domainIncludes: Person
rangeIncludes: Text

device
type: Property
comment: Device required to run the application. Used in cases where a specific make/model is required to run the application.
domainIncludes: SoftwareApplication
rangeIncludes: Text
supersededBy: availableOnDevice

Menu
type: Class
comment: A structured representation of food or drink items available from a FoodEstablishment.
subclass of: CreativeWork

Rating
type: Class
comment: A rating is an evaluation on a numeric scale, such as 1 to 5 stars.
subclass of: Intangible

ReservationStatusType
type: Class
comment: Enumerated status values for Reservation.
subclass of: StatusEnumeration

employmentType
type: Property
comment: Type of employment (e.g. full-time, part-time, contract, temporary, seasonal, internship).
domainIncludes: JobPosting
rangeIncludes: Text

WearableSizeSystemJP
type: WearableSizeSystemEnumeration
comment: Japanese size system for wearables.
isPartOf: pending.schema.org
source: https://github.com/schemaorg/schemaorg/issues/2811

recommendedIntake
type: Property
comment: Recommended intake of this supplement for a given population as defined by a specific recommending authority.
domainIncludes: DietarySupplement
isPartOf: health-lifesci.schema.org
rangeIncludes: RecommendedDoseSchedule

TransitMap
type: MapCategoryType
comment: A transit map.

termsPerYear
type: Property
comment: The number of times terms of study are offered per year. Semesters and quarters are common units for term. For example, if the student can only take 2 semesters for the program in one year, then termsPerYear should be 2.
domainIncludes: EducationalOccupationalProgram
isPartOf: pending.schema.org
rangeIncludes: Number
source: https://github.com/schemaorg/schemaorg/issues/2419

issueNumber
type: Property
equivalent property: issue
comment: Identifies the issue of publication; for example, "iii" or "2".
sub property of: position
contributor: bibex
domainIncludes: PublicationIssue
rangeIncludes: Text
rangeIncludes: Integer

landlord
type: Property
comment: A sub property of participant. The owner of the real estate property.
sub property of: participant
domainIncludes: RentAction
rangeIncludes: Organization
rangeIncludes: Person

lyricist
type: Property
comment: The person who wrote the words.
contributor: MBZ
domainIncludes: MusicComposition
rangeIncludes: Person

expertConsiderations
type: Property
comment: Medical expert advice related to the plan.
domainIncludes: Diet
isPartOf: health-lifesci.schema.org
rangeIncludes: Text

alcoholWarning
type: Property
comment: Any precaution, guidance, contraindication, etc. related to consumption of alcohol while taking this drug.
domainIncludes: Drug
isPartOf: health-lifesci.schema.org
rangeIncludes: Text

isBasedOn
type: Property
comment: A resource from which this work is derived or from which it is a modification or adaptation.
domainIncludes: CreativeWork
rangeIncludes: CreativeWork
rangeIncludes: Product
rangeIncludes: URL

GameServer
type: Class
comment: Server that provides game interaction in a multiplayer game.
subclass of: Intangible

permissionType
type: Property
comment: The type of permission granted the person, organization, or audience.
domainIncludes: DigitalDocumentPermission
rangeIncludes: DigitalDocumentPermissionType

HotelRoom
type: Class
comment: A hotel room is a single room in a hotel. See also the dedicated document on the use of schema.org for marking up hotels and other forms of accommodations.
subclass of: Room
contributor: STI Accommodation Ontology

DemoAlbum
type: MusicAlbumProductionType
comment: DemoAlbum.
contributor: MBZ

OrderProblem
type: OrderStatus
comment: OrderStatus representing that there is a problem with the order.

Motorcycle
type: Class
comment: A motorcycle or motorbike is a single-track, two-wheeled motor vehicle.
subclass of: Vehicle
contributor: Automotive Ontology Working Group
isPartOf: auto.schema.org

OceanBodyOfWater
type: Class
comment: An ocean (for example, the Pacific).
subclass of: BodyOfWater

sizeSystem
type: Property
comment: The size system used to identify a product's size. Typically either a standard (for example, "GS1" or "ISO-EN13402"), country code (for example "US" or "JP"), or a measuring system (for example "Metric" or "Imperial").
domainIncludes: SizeSpecification
isPartOf: pending.schema.org
rangeIncludes: Text
rangeIncludes: SizeSystemEnumeration
source: https://github.com/schemaorg/schemaorg/issues/2811

numItems
type: Property
comment: Limits the number of items being shipped for which these conditions apply.
domainIncludes: ShippingConditions
isPartOf: pending.schema.org
rangeIncludes: QuantitativeValue
source: https://github.com/schemaorg/schemaorg/issues/3617

MusicGroup
type: Class
comment: A musical group, such as a band, an orchestra, or a choir. Can also be a solo musician.
subclass of: PerformingGroup

RealEstateAgent
type: Class
comment: A real-estate agent.
subclass of: LocalBusiness

AndroidPlatform
type: DigitalPlatformEnumeration
comment: Represents the broad notion of Android-based operating systems.
isPartOf: pending.schema.org
source: https://github.com/schemaorg/schemaorg/issues/3057

HealthInsurancePlan
type: Class
comment: A US-style health insurance plan, including PPOs, EPOs, and HMOs.
subclass of: Intangible
isPartOf: pending.schema.org
source: https://github.com/schemaorg/schemaorg/issues/1062

antagonist
type: Property
comment: The muscle whose action counteracts the specified muscle.
domainIncludes: Muscle
isPartOf: health-lifesci.schema.org
rangeIncludes: Muscle

DepartmentStore
type: Class
comment: A department store.
subclass of: Store

AnatomicalSystem
type: Class
comment: An anatomical system is a group of anatomical structures that work together to perform a certain task. Anatomical systems, such as organ systems, are one organizing principle of anatomy, and can include circulatory, digestive, endocrine, integumentary, immune, lymphatic, muscular, nervous, reproductive, respiratory, skeletal, urinary, vestibular, and other systems.
subclass of: MedicalEntity
isPartOf: health-lifesci.schema.org

HealthCare
type: GovernmentBenefitsType
comment: HealthCare: this is a benefit for health care.
isPartOf: pending.schema.org
source: https://github.com/schemaorg/schemaorg/issues/2534

Locksmith
type: Class
comment: A locksmith.
subclass of: HomeAndConstructionBusiness

transmissionMethod
type: Property
comment: How the disease spreads, either as a route or vector, for example 'direct contact', 'Aedes aegypti', etc.
domainIncludes: InfectiousDisease
isPartOf: health-lifesci.schema.org
rangeIncludes: Text

MotorizedBicycle
type: Class
comment: A motorized bicycle is a bicycle with an attached motor used to power the vehicle, or to assist with pedaling.
subclass of: Vehicle
contributor: Automotive Ontology Working Group
isPartOf: auto.schema.org

courseMode
type: Property
comment: The medium or means of delivery of the course instance or the mode of study, either as a text label (e.g. "online", "onsite" or "blended"; "synchronous" or "asynchronous"; "full-time" or "part-time") or as a URL reference to a term from a controlled vocabulary (e.g. https://ceds.ed.gov/element/001311#Asynchronous).
domainIncludes: CourseInstance
rangeIncludes: Text
rangeIncludes: URL

Blog
type: Class
comment: A [blog](https://en.wikipedia.org/wiki/Blog), sometimes known as a "weblog". Note that the individual posts (BlogPostings) in a Blog are often colloquially referred to by the same term.
subclass of: CreativeWork

orderNumber
type: Property
equivalent property: OrderIdentifier
comment: The identifier of the transaction.
sub property of: identifier
domainIncludes: Order
rangeIncludes: Text

Chapter
type: Class
comment: One of the sections into which a book is divided. A chapter usually has a section number or a name.
subclass of: CreativeWork
isPartOf: bib.schema.org

Radiography
type: MedicalSpecialty
type: MedicalImagingTechnique
comment: Radiography is an imaging technique that uses electromagnetic radiation other than visible light, especially X-rays, to view the internal structure of a non-uniformly composed and opaque object such as the human body.
isPartOf: health-lifesci.schema.org

Ear
type: PhysicalExam
comment: Ear function assessment with clinical examination.
isPartOf: health-lifesci.schema.org

OTC
type: DrugPrescriptionStatus
comment: The character of a medical substance, typically a medicine, of being available over the counter or not.
isPartOf: health-lifesci.schema.org

OccupationalActivity
type: PhysicalActivityCategory
comment: Any physical activity engaged in for job-related purposes. Examples may include waiting tables, maid service, carrying a mailbag, picking fruits or vegetables, construction work, etc.
isPartOf: health-lifesci.schema.org

AssignAction
type: Class
comment: The act of allocating an action/event/task to some destination (someone or something).
subclass of: AllocateAction

subtitleLanguage
type: Property
comment: Languages in which subtitles/captions are available, in [IETF BCP 47 standard format](http://tools.ietf.org/html/bcp47).
domainIncludes: BroadcastEvent
domainIncludes: TVEpisode
domainIncludes: ScreeningEvent
domainIncludes: Movie
isPartOf: pending.schema.org
rangeIncludes: Text
rangeIncludes: Language
source: https://github.com/schemaorg/schemaorg/issues/2110

UserComments
type: Class
comment: UserInteraction and its subtypes is an old way of talking about users interacting with pages. It is generally better to use Action-based vocabulary, alongside types such as Comment.
subclass of: UserInteraction
contributor: rNews
supersededBy: InteractionCounter

DrugPrescriptionStatus
type: Class
comment: Indicates whether this drug is available by prescription or over-the-counter.
subclass of: MedicalEnumeration
isPartOf: health-lifesci.schema.org

SuperficialAnatomy
type: Class
comment: Anatomical features that can be observed by sight (without dissection), including the form and proportions of the human body as well as surface landmarks that correspond to deeper subcutaneous structures. Superficial anatomy plays an important role in sports medicine, phlebotomy, and other medical specialties as underlying anatomical structures can be identified through surface palpation. For example, during back surgery, superficial anatomy can be used to palpate and count vertebrae to find the site of incision. Or in phlebotomy, superficial anatomy can be used to locate an underlying vein; for example, the median cubital vein can be located by palpating the borders of the cubital fossa (such as the epicondyles of the humerus) and then looking for the superficial signs of the vein, such as size, prominence, ability to refill after depression, and feel of surrounding tissue support. As another example, in a subluxation (dislocation) of the glenohumeral joint, the bony structure becomes pronounced with the deltoid muscle failing to cover the glenohumeral joint allowing the edges of the scapula to be superficially visible. Here, the superficial anatomy is the visible edges of the scapula, implying the underlying dislocation of the joint (the related anatomical structure).
subclass of: MedicalEntity
isPartOf: health-lifesci.schema.org

ParentAudience
type: Class
comment: A set of characteristics describing parents, who can be interested in viewing some content.
subclass of: PeopleAudience

OpenTrial
type: MedicalTrialDesign
comment: A trial design in which the researcher knows the full details of the treatment, and so does the patient.
isPartOf: health-lifesci.schema.org

BroadcastService
type: Class
comment: A delivery service through which content is provided via broadcast over the air or online.
subclass of: Service

LoanOrCredit
type: Class
comment: A financial product for the loaning of an amount of money, or line of credit, under agreed terms and charges.
subclass of: FinancialProduct
contributor: FIBO

codeSampleType
type: Property
comment: What type of code sample: full (compile ready) solution, code snippet, inline code, scripts, template.
domainIncludes: SoftwareSourceCode
rangeIncludes: Text

Permit
type: Class
comment: A permit issued by an organization, e.g. a parking pass.
subclass of: Intangible

MeetingRoom
type: Class
comment: A meeting room, conference room, or conference hall is a room provided for singular events such as business conferences and meetings (source: Wikipedia, the free encyclopedia, see http://en.wikipedia.org/wiki/Conference_hall). See also the dedicated document on the use of schema.org for marking up hotels and other forms of accommodations.
subclass of: Room
contributor: STI Accommodation Ontology

DefinedTerm
type: Class
comment: A word, name, acronym, phrase, etc. with a formal definition. Often used in the context of category or subject classification, glossaries or dictionaries, product or creative work types, etc. Use the name property for the term being defined, use termCode if the term has an alpha-numeric code allocated, use description to provide the definition of the term. Use the about property to specify what the term is about.
subclass of: Intangible
isPartOf: pending.schema.org
source: https://github.com/schemaorg/schemaorg/issues/894

ReturnAtKiosk
type: ReturnMethodEnumeration
comment: Specifies that product returns must be made at a kiosk.
isPartOf: pending.schema.org
source: https://github.com/schemaorg/schemaorg/issues/2880

Installment
type: PriceComponentTypeEnumeration
comment: Represents the installment pricing component of the total price for an offered product.
isPartOf: pending.schema.org
source: https://github.com/schemaorg/schemaorg/issues/2689

familyName
type: Property
comment: Family name. In the U.S., the last name of a Person.
domainIncludes: Person
rangeIncludes: Text

WearableMeasurementSleeve
type: WearableMeasurementTypeEnumeration
comment: Measurement of the sleeve length, for example of a shirt.
isPartOf: pending.schema.org
source: https://github.com/schemaorg/schemaorg/issues/2811

AuthoritativeLegalValue
type: LegalValueLevel
comment: Indicates that the publisher gives some special status to the publication of the document. ("The Queens Printer" version of a UK Act of Parliament, or the PDF version of a Directive published by the EU Office of Publications). Something "Authoritative" is considered to be also OfficialLegalValue".
contributor: ELI
isPartOf: pending.schema.org
source: https://github.com/schemaorg/schemaorg/issues/1156
source: eli

Nonprofit501c26
type: USNonprofitType
comment: Nonprofit501c26: Non-profit type referring to State-Sponsored Organizations Providing Health Coverage for High-Risk Individuals.
isPartOf: pending.schema.org
source: https://github.com/schemaorg/schemaorg/issues/2543

medicalSpecialty
type: Property
comment: A medical specialty of the provider.
domainIncludes: MedicalClinic
domainIncludes: Physician
domainIncludes: MedicalOrganization
domainIncludes: Hospital
isPartOf: health-lifesci.schema.org
rangeIncludes: MedicalSpecialty

weightPercentage
type: Property
comment: Value representing the fraction of the weight that is used to compute the shipping price. Example: 0.10 and a shipping weight of 15kg would add $1.5 to the order price, where the $ is the currency of the order.
domainIncludes: ShippingRateSettings
isPartOf: pending.schema.org
rangeIncludes: Number
source: https://github.com/schemaorg/schemaorg/issues/3617

Osteopathic
type: MedicineSystem
comment: A system of medicine focused on promoting the body's innate ability to heal itself.
isPartOf: health-lifesci.schema.org

colorist
type: Property
comment: The individual who adds color to inked drawings.
domainIncludes: VisualArtwork
domainIncludes: ComicStory
domainIncludes: ComicIssue
isPartOf: bib.schema.org
rangeIncludes: Person

mileageFromOdometer
type: Property
comment: The total distance travelled by the particular vehicle since its initial production, as read from its odometer.\n\nTypical unit code(s): KMT for kilometers, SMI for statute miles.
contributor: Automotive Ontology Working Group
domainIncludes: Vehicle
rangeIncludes: QuantitativeValue

studySubject
type: Property
comment: A subject of the study, i.e. one of the medical conditions, therapies, devices, drugs, etc. investigated by the study.
domainIncludes: MedicalStudy
isPartOf: health-lifesci.schema.org
rangeIncludes: MedicalEntity

claimReviewed
type: Property
comment: A short summary of the specific claims reviewed in a ClaimReview.
domainIncludes: ClaimReview
rangeIncludes: Text
source: https://github.com/schemaorg/schemaorg/issues/1061

geoCoveredBy
type: Property
comment: Represents a relationship between two geometries (or the places they represent), relating a geometry to another that covers it. As defined in [DE-9IM](https://en.wikipedia.org/wiki/DE-9IM).
domainIncludes: GeospatialGeometry
domainIncludes: Place
rangeIncludes: GeospatialGeometry
rangeIncludes: Place

orderItemNumber
type: Property
equivalent property: LineItemIdentifier
comment: The identifier of the order item.
domainIncludes: OrderItem
rangeIncludes: Text

doorTime
type: Property
comment: The time admission will commence.
domainIncludes: Event
rangeIncludes: DateTime
rangeIncludes: Time

FastFoodRestaurant
type: Class
comment: A fast-food restaurant.
subclass of: FoodEstablishment

color
type: Property
equivalent property: colourDescription
comment: The color of the product.
contributor: GoodRelationsTerms
domainIncludes: Product
rangeIncludes: Text

bookingTime
type: Property
comment: The date and time the reservation was booked.
domainIncludes: Reservation
rangeIncludes: DateTime

EmployeeRole
type: Class
comment: A subclass of OrganizationRole used to describe employee relationships.
subclass of: OrganizationRole

GeoCoordinates
type: Class
equivalent class: GeographicCoordinate
equivalent class: GeographicalCoordinate
comment: The geographic coordinates of a place or event.
subclass of: StructuredValue

SoundtrackAlbum
type: MusicAlbumProductionType
comment: SoundtrackAlbum.
contributor: MBZ

serverStatus
type: Property
comment: Status of a game server.
domainIncludes: GameServer
rangeIncludes: GameServerStatus

courseCode
type: Property
comment: The identifier for the Course used by the course provider (e.g. CS101 or 6.001).
domainIncludes: Course
rangeIncludes: Text

HowToItem
type: Class
comment: An item used as either a tool or supply when performing the instructions for how to achieve a result.
subclass of: ListItem

WearableMeasurementHeight
type: WearableMeasurementTypeEnumeration
comment: Measurement of the height, for example the heel height of a shoe.
isPartOf: pending.schema.org
source: https://github.com/schemaorg/schemaorg/issues/2811

AnimalShelter
type: Class
comment: Animal shelter.
subclass of: LocalBusiness

codingSystem
type: Property
comment: The coding system, e.g. 'ICD-10'.
domainIncludes: MedicalCode
isPartOf: health-lifesci.schema.org
rangeIncludes: Text

Thursday
type: DayOfWeek
comment: The day of the week between Wednesday and Friday.

Nonprofit501c15
type: USNonprofitType
comment: Nonprofit501c15: Non-profit type referring to Mutual Insurance Companies or Associations.
isPartOf: pending.schema.org
source: https://github.com/schemaorg/schemaorg/issues/2543

BookmarkAction
type: Class
comment: An agent bookmarks/flags/labels/tags/marks an object.
subclass of: OrganizeAction

LaserDiscFormat
type: MusicReleaseFormatType
comment: LaserDiscFormat.
contributor: MBZ

isBasedOnUrl
type: Property
comment: A resource that was used in the creation of this resource. This term can be repeated for multiple sources. For example, http://example.com/great-multiplication-intro.html.
domainIncludes: CreativeWork
rangeIncludes: CreativeWork
rangeIncludes: Product
rangeIncludes: URL
supersededBy: isBasedOn

driveWheelConfiguration
type: Property
comment: The drive wheel configuration, i.e. which roadwheels will receive torque from the vehicle's engine via the drivetrain.
contributor: Automotive Ontology Working Group
domainIncludes: Vehicle
rangeIncludes: DriveWheelConfigurationValue
rangeIncludes: Text

LikeAction
type: Class
comment: The act of expressing a positive sentiment about the object. An agent likes an object (a proposition, topic or theme) with participants.
subclass of: ReactAction

IncentiveType
type: Class
comment: Enumerates common financial incentives for products, including tax credits, tax deductions, rebates and subsidies, etc.
subclass of: Enumeration
isPartOf: pending.schema.org
source: https://github.com/schemaorg/schemaorg/issues/3572

WearableSizeGroupRegular
type: WearableSizeGroupEnumeration
comment: Size group "Regular" for wearables.
isPartOf: pending.schema.org
source: https://github.com/schemaorg/schemaorg/issues/2811

followee
type: Property
comment: A sub property of object. The person or organization being followed.
sub property of: object
domainIncludes: FollowAction
rangeIncludes: Person
rangeIncludes: Organization

object
type: Property
comment: The object upon which the action is carried out, whose state is kept intact or changed. Also known as the semantic roles patient, affected or undergoer (which change their state) or theme (which doesn't). E.g. John read *a book*.
domainIncludes: Action
rangeIncludes: Thing

ethicsPolicy
type: Property
comment: Statement about ethics policy, e.g. of a NewsMediaOrganization regarding journalistic and publishing practices, or of a Restaurant, a page describing food source policies. In the case of a NewsMediaOrganization, an ethicsPolicy is typically a statement describing the personal, organizational, and corporate standards of behavior expected by the organization.
domainIncludes: Organization
domainIncludes: NewsMediaOrganization
isPartOf: pending.schema.org
rangeIncludes: CreativeWork
rangeIncludes: URL
source: https://github.com/schemaorg/schemaorg/issues/1525

runtimePlatform
type: Property
comment: Runtime platform or script interpreter dependencies (example: Java v1, Python 2.3, .NET Framework 3.0).
domainIncludes: SoftwareSourceCode
domainIncludes: SoftwareApplication
rangeIncludes: RuntimePlatform
rangeIncludes: Text

eduQuestionType
type: Property
comment: For questions that are part of learning resources (e.g. Quiz), eduQuestionType indicates the format of question being given. Example: "Multiple choice", "Open ended", "Flashcard".
domainIncludes: SolveMathAction
domainIncludes: Question
isPartOf: pending.schema.org
rangeIncludes: Text
source: https://github.com/schemaorg/schemaorg/issues/2636

OrderProcessing
type: OrderStatus
comment: OrderStatus representing that an order is being processed.

associatedAnatomy
type: Property
comment: The anatomy of the underlying organ system or structures associated with this entity.
domainIncludes: PhysicalActivity
domainIncludes: MedicalCondition
isPartOf: health-lifesci.schema.org
rangeIncludes: SuperficialAnatomy
rangeIncludes: AnatomicalStructure
rangeIncludes: AnatomicalSystem

appliesToPaymentMethod
type: Property
comment: The payment method(s) to which the payment charge specification applies.
contributor: GoodRelationsTerms
domainIncludes: PaymentChargeSpecification
rangeIncludes: PaymentMethod

dependencies
type: Property
comment: Prerequisites needed to fulfill steps in article.
domainIncludes: TechArticle
rangeIncludes: Text

BusinessFunction
type: Class
comment: The business function specifies the type of activity or access (i.e., the bundle of rights) offered by the organization or business person through the offer. Typical are sell, rental or lease, maintenance or repair, manufacture / produce, recycle / dispose, engineering / construction, or installation. Proprietary specifications of access rights are also instances of this class.\n\nCommonly used values:\n\n* http://purl.org/goodrelations/v1#ConstructionInstallation\n* http://purl.org/goodrelations/v1#Dispose\n* http://purl.org/goodrelations/v1#LeaseOut\n* http://purl.org/goodrelations/v1#Maintain\n* http://purl.org/goodrelations/v1#ProvideService\n* http://purl.org/goodrelations/v1#Repair\n* http://purl.org/goodrelations/v1#Sell\n* http://purl.org/goodrelations/v1#Buy
subclass of: Enumeration
contributor: good-relations-and-schema-org

dietFeatures
type: Property
comment: Nutritional information specific to the dietary plan. May include dietary recommendations on what foods to avoid, what foods to consume, and specific alterations/deviations from the USDA or other regulatory body's approved dietary guidelines.
domainIncludes: Diet
isPartOf: health-lifesci.schema.org
rangeIncludes: Text

ScholarlyArticle
type: Class
comment: A scholarly article.
subclass of: Article

servicePostalAddress
type: Property
comment: The address for accessing the service by mail.
sub property of: hasAddress
domainIncludes: ServiceChannel
rangeIncludes: PostalAddress

PreOrder
type: ItemAvailability
comment: Indicates that the item is available for pre-order.

hasMerchantReturnPolicy
type: Property
comment: Specifies a MerchantReturnPolicy that may be applicable.
domainIncludes: Organization
domainIncludes: Product
domainIncludes: Offer
isPartOf: pending.schema.org
rangeIncludes: MerchantReturnPolicy
source: https://github.com/schemaorg/schemaorg/issues/2288

isAvailableGenerically
type: Property
comment: True if the drug is available in a generic form (regardless of name).
domainIncludes: Drug
isPartOf: health-lifesci.schema.org
rangeIncludes: Boolean

buyer
type: Property
comment: A sub property of participant. The participant/person/organization that bought the object.
sub property of: participant
domainIncludes: SellAction
rangeIncludes: Organization
rangeIncludes: Person

OpinionNewsArticle
type: Class
comment: An OpinionNewsArticle is a NewsArticle that primarily expresses opinions rather than journalistic reporting of news and events. For example, a NewsArticle consisting of a column or Blog/BlogPosting entry in the Opinions section of a news publication.
subclass of: NewsArticle
contributor: TP
isPartOf: pending.schema.org
source: https://github.com/schemaorg/schemaorg/issues/1525

PrognosisHealthAspect
type: HealthAspectEnumeration
comment: Typical progression and happenings of life course of the topic.
isPartOf: pending.schema.org
source: https://github.com/schemaorg/schemaorg/issues/2374

sugarContent
type: Property
comment: The number of grams of sugar.
domainIncludes: NutritionInformation
rangeIncludes: Mass

howPerformed
type: Property
comment: How the procedure is performed.
domainIncludes: MedicalProcedure
isPartOf: health-lifesci.schema.org
rangeIncludes: Text

awards
type: Property
comment: Awards won by or for this item.
domainIncludes: Organization
domainIncludes: Person
domainIncludes: CreativeWork
domainIncludes: Product
rangeIncludes: Text
supersededBy: award

flightDistance
type: Property
comment: The distance of the flight.
domainIncludes: Flight
rangeIncludes: Text
rangeIncludes: Distance

countryOfLastProcessing
type: Property
equivalent property: ProcessingCountry
comment: The place where the item (typically Product) was last processed and tested before importation.
domainIncludes: Product
isPartOf: pending.schema.org
rangeIncludes: Text
source: https://github.com/schemaorg/schemaorg/issues/991

upvoteCount
type: Property
comment: The number of upvotes this question, answer or comment has received from the community.
domainIncludes: Comment
rangeIncludes: Integer

customer
type: Property
comment: Party placing the order or paying the invoice.
domainIncludes: Order
domainIncludes: Invoice
rangeIncludes: Organization
rangeIncludes: Person

ReplaceAction
type: Class
comment: The act of editing a recipient by replacing an old object with a new object.
subclass of: UpdateAction

polygon
type: Property
comment: A polygon is the area enclosed by a point-to-point path for which the starting and ending points are the same. A polygon is expressed as a series of four or more space delimited points where the first and final points are identical.
domainIncludes: GeoShape
rangeIncludes: Text

missionCoveragePrioritiesPolicy
type: Property
comment: For a NewsMediaOrganization, a statement on coverage priorities, including any public agenda or stance on issues.
sub property of: publishingPrinciples
contributor: TP
domainIncludes: NewsMediaOrganization
isPartOf: pending.schema.org
rangeIncludes: CreativeWork
rangeIncludes: URL
source: https://github.com/schemaorg/schemaorg/issues/1525

vehicleEngine
type: Property
comment: Information about the engine or engines of the vehicle.
contributor: Automotive Ontology Working Group
domainIncludes: Vehicle
rangeIncludes: EngineSpecification

exercisePlan
type: Property
comment: A sub property of instrument. The exercise plan used on this action.
sub property of: instrument
domainIncludes: ExerciseAction
isPartOf: health-lifesci.schema.org
rangeIncludes: ExercisePlan

RespiratoryTherapy
type: MedicalSpecialty
comment: The therapy that is concerned with the maintenance or improvement of respiratory function (as in patients with pulmonary disease).
subclass of: MedicalTherapy
isPartOf: health-lifesci.schema.org

mealService
type: Property
comment: Description of the meals that will be provided or available for purchase.
domainIncludes: Flight
rangeIncludes: Text

DateTime
type: Class
type: DataType
equivalent class: DateTime
comment: A combination of date and time of day in the form [-]CCYY-MM-DDThh:mm:ss[Z|(+|-)hh:mm] (see Chapter 5.4 of ISO 8601).

DigitalDocument
type: Class
equivalent class: ElectronicDocument
comment: An electronic file or document.
subclass of: CreativeWork
subclass of: Document

performers
type: Property
comment: The main performer or performers of the event—for example, a presenter, musician, or actor.
domainIncludes: Event
rangeIncludes: Organization
rangeIncludes: Person
supersededBy: performer

SkiResort
type: Class
comment: A ski resort.
subclass of: Resort
subclass of: SportsActivityLocation

EventReservation
type: Class
comment: A reservation for an event like a concert, sporting event, or lecture.\n\nNote: This type is for information about actual reservations, e.g. in confirmation emails or HTML pages with individual confirmations of reservations. For offers of tickets, use Offer.
subclass of: Reservation

SuspendAction
type: Class
comment: The act of momentarily pausing a device or application (e.g. pause music playback or pause a timer).
subclass of: ControlAction

runtime
type: Property
comment: Runtime platform or script interpreter dependencies (example: Java v1, Python 2.3, .NET Framework 3.0).
domainIncludes: SoftwareSourceCode
rangeIncludes: Text
supersededBy: runtimePlatform

urlTemplate
type: Property
comment: An url template (RFC6570) that will be used to construct the target of the execution of the action.
domainIncludes: EntryPoint
rangeIncludes: Text

ProfessionalService
type: Class
comment: Original definition: "provider of professional services."\n\nThe general ProfessionalService type for local businesses was deprecated due to confusion with Service. For reference, the types that it included were: Dentist, AccountingService, Attorney, Notary, as well as types for several kinds of HomeAndConstructionBusiness: Electrician, GeneralContractor, HousePainter, Locksmith, Plumber, RoofingContractor. LegalService was introduced as a more inclusive supertype of Attorney.
subclass of: LocalBusiness

acquiredFrom
type: Property
comment: The organization or person from which the product was acquired.
contributor: GoodRelationsTerms
domainIncludes: OwnershipInfo
rangeIncludes: Organization
rangeIncludes: Person

Nonprofit501c25
type: USNonprofitType
comment: Nonprofit501c25: Non-profit type referring to Real Property Title-Holding Corporations or Trusts with Multiple Parents.
isPartOf: pending.schema.org
source: https://github.com/schemaorg/schemaorg/issues/2543

WesternConventional
type: MedicineSystem
comment: The conventional Western system of medicine, that aims to apply the best available evidence gained from the scientific method to clinical decision making. Also known as conventional or Western medicine.
isPartOf: health-lifesci.schema.org

drainsTo
type: Property
comment: The vasculature that the vein drains into.
domainIncludes: Vein
isPartOf: health-lifesci.schema.org
rangeIncludes: Vessel

OfferItemCondition
type: Class
comment: A list of possible conditions for the item.
subclass of: Enumeration

EntertainmentBusiness
type: Class
comment: A business providing entertainment.
subclass of: LocalBusiness

cvdNumC19HospPats
type: Property
comment: numc19hosppats - HOSPITALIZED: Patients currently hospitalized in an inpatient care location who have suspected or confirmed COVID-19.
domainIncludes: CDCPMDRecord
isPartOf: pending.schema.org
rangeIncludes: Number
source: https://github.com/schemaorg/schemaorg/issues/2521

IncentiveStatusInDevelopment
type: IncentiveStatus
comment: This incentive is currently being developed, and may become active/retired in the future.
isPartOf: pending.schema.org
source: https://github.com/schemaorg/schemaorg/issues/3572

publicTransportClosuresInfo
type: Property
comment: Information about public transport closures.
domainIncludes: SpecialAnnouncement
isPartOf: pending.schema.org
rangeIncludes: WebContent
rangeIncludes: URL
source: https://github.com/schemaorg/schemaorg/issues/2490

application
type: Property
comment: An application that can complete the request.
domainIncludes: EntryPoint
rangeIncludes: SoftwareApplication
supersededBy: actionApplication

feesAndCommissionsSpecification
type: Property
comment: Description of fees, commissions, and other terms applied either to a class of financial product, or by a financial service organization.
contributor: FIBO
domainIncludes: FinancialProduct
domainIncludes: FinancialService
rangeIncludes: Text
rangeIncludes: URL

WPFooter
type: Class
comment: The footer section of the page.
subclass of: WebPageElement

Pulmonary
type: MedicalSpecialty
comment: A specific branch of medical science that pertains to the study of the respiratory system and its respective disease states.
isPartOf: health-lifesci.schema.org

RsvpResponseType
type: Class
comment: RsvpResponseType is an enumeration type whose instances represent responding to an RSVP request.
subclass of: Enumeration

Volcano
type: Class
comment: A volcano, like Fujisan.
subclass of: Landform

ApartmentComplex
type: Class
comment: Residence type: Apartment complex.
subclass of: Residence

MedicalProcedureType
type: Class
comment: An enumeration that describes different types of medical procedures.
subclass of: MedicalEnumeration
isPartOf: health-lifesci.schema.org

ItemPage
type: Class
comment: A page devoted to a single item, such as a particular product or hotel.
subclass of: WebPage

TransferAction
type: Class
comment: The act of transferring/moving (abstract or concrete) animate or inanimate objects from one place to another.
subclass of: Action

billingIncrement
type: Property
comment: This property specifies the minimal quantity and rounding increment that will be the basis for the billing. The unit of measurement is specified by the unitCode property.
contributor: GoodRelationsTerms
domainIncludes: UnitPriceSpecification
rangeIncludes: Number

MotorcycleDealer
type: Class
comment: A motorcycle dealer.
subclass of: AutomotiveBusiness

bodyType
type: Property
comment: Indicates the design and body style of the vehicle (e.g. station wagon, hatchback, etc.).
contributor: Automotive Ontology Working Group
domainIncludes: Vehicle
isPartOf: auto.schema.org
rangeIncludes: Text
rangeIncludes: URL
rangeIncludes: QualitativeValue

Joint
type: Class
comment: The anatomical location at which two or more bones make contact.
subclass of: AnatomicalStructure
isPartOf: health-lifesci.schema.org

Date
type: Class
type: DataType
equivalent class: Date
comment: A date value in [ISO 8601 date format](http://en.wikipedia.org/wiki/ISO_8601).

seriousAdverseOutcome
type: Property
comment: A possible serious complication and/or serious side effect of this therapy. Serious adverse outcomes include those that are life-threatening; result in death, disability, or permanent damage; require hospitalization or prolong existing hospitalization; cause congenital anomalies or birth defects; or jeopardize the patient and may require medical or surgical intervention to prevent one of the outcomes in this definition.
domainIncludes: MedicalTherapy
domainIncludes: MedicalDevice
isPartOf: health-lifesci.schema.org
rangeIncludes: MedicalEntity

DigitalDocumentPermission
type: Class
comment: A permission for a particular person or group to access a particular file.
subclass of: Intangible

RadioSeries
type: Class
comment: CreativeWorkSeries dedicated to radio broadcast and associated online delivery.
subclass of: CreativeWorkSeries

productID
type: Property
comment: The product identifier, such as ISBN. For example: ``` meta itemprop="productID" content="isbn:123-456-789" ```.
sub property of: identifier
domainIncludes: Product
rangeIncludes: Text

NonprofitType
type: Class
comment: NonprofitType enumerates several kinds of official non-profit types of which a non-profit organization can be.
subclass of: Enumeration
isPartOf: pending.schema.org
source: https://github.com/schemaorg/schemaorg/issues/2543

AggregateOffer
type: Class
comment: When a single product is associated with multiple offers (for example, the same pair of shoes is offered by different merchants), then AggregateOffer can be used.\n\nNote: AggregateOffers are normally expected to associate multiple offers that all share the same defined businessFunction value, or default to http://purl.org/goodrelations/v1#Sell if businessFunction is not explicitly defined.
subclass of: Offer

WearableMeasurementInseam
type: WearableMeasurementTypeEnumeration
comment: Measurement of the inseam, for example of pants.
isPartOf: pending.schema.org
source: https://github.com/schemaorg/schemaorg/issues/2811

interactionStatistic
type: Property
comment: The number of interactions for the CreativeWork using the WebSite or SoftwareApplication. The most specific child type of InteractionCounter should be used.
domainIncludes: Organization
domainIncludes: Person
domainIncludes: CreativeWork
rangeIncludes: InteractionCounter
source: https://github.com/schemaorg/schemaorg/issues/2421

OrderPaymentDue
type: OrderStatus
comment: OrderStatus representing that payment is due on an order.

TherapeuticProcedure
type: Class
equivalent class: http://purl.bioontology.org/ontology/SNOMEDCT/277132007
comment: A medical procedure intended primarily for therapeutic purposes, aimed at improving a health condition.
subclass of: MedicalProcedure
isPartOf: health-lifesci.schema.org

jobStartDate
type: Property
comment: The date on which a successful applicant for this job would be expected to start work. Choose a specific date in the future or use the jobImmediateStart property to indicate the position is to be filled as soon as possible.
domainIncludes: JobPosting
isPartOf: pending.schema.org
rangeIncludes: Date
rangeIncludes: Text
source: https://github.com/schemaorg/schemaorg/issues/2244

estimatedSalary
type: Property
comment: An estimated salary for a job posting or occupation, based on a variety of variables including, but not limited to industry, job title, and location. Estimated salaries are often computed by outside organizations rather than the hiring organization, who may not have committed to the estimated value.
domainIncludes: Occupation
domainIncludes: JobPosting
rangeIncludes: MonetaryAmountDistribution
rangeIncludes: MonetaryAmount
rangeIncludes: Number
source: https://github.com/schemaorg/schemaorg/issues/1698

employees
type: Property
comment: People working for this organization.
domainIncludes: Organization
rangeIncludes: Person
supersededBy: employee

Crematorium
type: Class
comment: A crematorium.
subclass of: CivicStructure

targetPlatform
type: Property
comment: Type of app development: phone, Metro style, desktop, XBox, etc.
domainIncludes: APIReference
rangeIncludes: Text

geo
type: Property
comment: The geo coordinates of the place.
domainIncludes: Place
rangeIncludes: GeoShape
rangeIncludes: GeoCoordinates

recipeIngredient
type: Property
comment: An ingredient or ordered list of ingredients and potentially quantities used in the recipe, e.g. 1 cup of sugar, flour or garlic. The ingredients can be represented as free text or more structured values.
sub property of: supply
domainIncludes: Recipe
rangeIncludes: Text
rangeIncludes: ItemList
rangeIncludes: PropertyValue

TheaterGroup
type: Class
comment: A theater group or company, for example, the Royal Shakespeare Company or Druid Theatre.
subclass of: PerformingGroup

assemblyVersion
type: Property
comment: Associated product/technology version. E.g., .NET Framework 4.5.
domainIncludes: APIReference
rangeIncludes: Text

PurchaseTypeLease
type: PurchaseType
comment: This is a lease of an item.
isPartOf: pending.schema.org
source: https://github.com/schemaorg/schemaorg/issues/3572

contentUrl
type: Property
comment: Actual bytes of the media object, for example the image file or video file.
domainIncludes: MediaObject
rangeIncludes: URL

supply
type: Property
comment: A sub-property of instrument. A supply consumed when performing instructions or a direction.
sub property of: instrument
domainIncludes: HowTo
domainIncludes: HowToDirection
rangeIncludes: Text
rangeIncludes: HowToSupply

PlaceboControlledTrial
type: MedicalTrialDesign
comment: A placebo-controlled trial design.
isPartOf: health-lifesci.schema.org

source
type: Property
comment: The source or cause of the event.
domainIncludes: InstantaneousEvent
isPartOf: pending.schema.org
rangeIncludes: Thing
source: https://github.com/schemaorg/schemaorg/issues/4527

recommendationStrength
type: Property
comment: Strength of the guideline's recommendation (e.g. 'class I').
domainIncludes: MedicalGuidelineRecommendation
isPartOf: health-lifesci.schema.org
rangeIncludes: Text

geoTouches
type: Property
comment: Represents spatial relations in which two geometries (or the places they represent) touch: "they have at least one boundary point in common, but no interior points." (A symmetric relationship, as defined in [DE-9IM](https://en.wikipedia.org/wiki/DE-9IM).)
domainIncludes: Place
domainIncludes: GeospatialGeometry
rangeIncludes: Place
rangeIncludes: GeospatialGeometry

fundedItem
type: Property
comment: Indicates something directly or indirectly funded or sponsored through a Grant. See also ownershipFundingInfo.
contributor: TP
domainIncludes: Grant
inverseOf: funding
isPartOf: pending.schema.org
rangeIncludes: Person
rangeIncludes: MedicalEntity
rangeIncludes: Event
rangeIncludes: CreativeWork
rangeIncludes: Product
rangeIncludes: Organization
rangeIncludes: BioChemEntity
source: https://github.com/schemaorg/schemaorg/issues/383
source: https://github.com/schemaorg/schemaorg/issues/1950

MultiFrameComputationalCaptureDigitalSource
type: IPTCDigitalSourceEnumeration
comment: Content coded as 'algorithmic media' using the IPTC digital source type vocabulary.
isPartOf: pending.schema.org
source: https://github.com/schemaorg/schemaorg/issues/3392

postOfficeBoxNumber
type: Property
equivalent property: postOfficeBoxNumber
equivalent property: postOfficeBox
comment: The post office box number for PO box addresses.
domainIncludes: PostalAddress
rangeIncludes: Text

MusicRelease
type: Class
comment: A MusicRelease is a specific release of a music album.
subclass of: MusicPlaylist
contributor: MBZ

SpecialAnnouncement
type: Class
comment: A SpecialAnnouncement combines a simple date-stamped textual information update with contextualized Web links and other structured data. It represents an information update made by a locally-oriented organization, for example schools, pharmacies, healthcare providers, community groups, police, local government. For work in progress guidelines on Coronavirus-related markup see [this doc](https://docs.google.com/document/d/14ikaGCKxo50rRM7nvKSlbUpjyIk2WMQd3IkB1lItlrM/edit#). The motivating scenario for SpecialAnnouncement is the [Coronavirus pandemic](https://en.wikipedia.org/wiki/2019%E2%80%9320_coronavirus_pandemic), and the initial vocabulary is oriented to this urgent situation. Schema.org expect to improve the markup iteratively as it is deployed and as feedback emerges from use. In addition to our usual [Github entry](https://github.com/schemaorg/schemaorg/issues/2490), feedback comments can also be provided in [this document](https://docs.google.com/document/d/1fpdFFxk8s87CWwACs53SGkYv3aafSxz_DTtOQxMrBJQ/edit#). While this schema is designed to communicate urgent crisis-related information, it is not the same as an emergency warning technology like [CAP](https://en.wikipedia.org/wiki/Common_Alerting_Protocol), although there may be overlaps. The intent is to cover the kinds of everyday practical information being posted to existing websites during an emergency situation. Several kinds of information can be provided: We encourage the provision of "name", "text", "datePosted", "expires" (if appropriate), "category" and "url" as a simple baseline. It is important to provide a value for "category" where possible, most ideally as a well known URL from Wikipedia or Wikidata. In the case of the 2019-2020 Coronavirus pandemic, this should be "https://en.wikipedia.org/w/index.php?title=2019-20\_coronavirus\_pandemic" or "https://www.wikidata.org/wiki/Q81068910". For many of the possible properties, values can either be simple links or an inline description, depending on…
subclass of: CreativeWork
isPartOf: pending.schema.org
source: https://github.com/schemaorg/schemaorg/issues/2490

jobTitle
type: Property
comment: The job title of the person (for example, Financial Manager).
domainIncludes: Person
isPartOf: pending.schema.org
rangeIncludes: Text
rangeIncludes: DefinedTerm
source: https://github.com/schemaorg/schemaorg/issues/2192

CoOp
type: GamePlayMode
comment: Play mode: CoOp. Co-operative games, where you play on the same team with friends.

associatedPathophysiology
type: Property
comment: If applicable, a description of the pathophysiology associated with the anatomical system, including potential abnormal changes in the mechanical, physical, and biochemical functions of the system.
domainIncludes: AnatomicalSystem
domainIncludes: SuperficialAnatomy
domainIncludes: AnatomicalStructure
isPartOf: health-lifesci.schema.org
rangeIncludes: Text

endorsers
type: Property
comment: People or organizations that endorse the plan.
domainIncludes: Diet
isPartOf: health-lifesci.schema.org
rangeIncludes: Organization
rangeIncludes: Person

OrganizeAction
type: Class
comment: The act of manipulating/administering/supervising/controlling one or more objects.
subclass of: Action

ReturnLabelCustomerResponsibility
type: ReturnLabelSourceEnumeration
comment: Indicated that creating a return label is the responsibility of the customer.
isPartOf: pending.schema.org
source: https://github.com/schemaorg/schemaorg/issues/2880

UKTrust
type: UKNonprofitType
comment: UKTrust: Non-profit type referring to a UK trust.
isPartOf: pending.schema.org
source: https://github.com/schemaorg/schemaorg/issues/2543

Periodical
type: Class
equivalent class: Periodical
comment: A publication in any medium issued in successive parts bearing numerical or chronological designations and intended to continue indefinitely, such as a magazine, scholarly journal, or newspaper.\n\nSee also [blog post](https://blog.schema.org/2014/09/02/schema-org-support-for-bibliographic-relationships-and-periodicals/).
subclass of: CreativeWorkSeries
contributor: bibex

educationRequirements
type: Property
comment: Educational background needed for the position or Occupation.
domainIncludes: Occupation
domainIncludes: JobPosting
isPartOf: pending.schema.org
rangeIncludes: EducationalOccupationalCredential
rangeIncludes: Text
source: https://github.com/schemaorg/schemaorg/issues/1698
source: https://github.com/schemaorg/schemaorg/issues/1779

cargoVolume
type: Property
comment: The available volume for cargo or luggage. For automobiles, this is usually the trunk volume.\n\nTypical unit code(s): LTR for liters, FTQ for cubic foot/feet\n\nNote: You can use minValue and maxValue to indicate ranges.
contributor: Automotive Ontology Working Group
domainIncludes: Vehicle
rangeIncludes: QuantitativeValue

SocialMediaPosting
type: Class
comment: A post to a social media platform, including blog posts, tweets, Facebook posts, etc.
subclass of: Article

headline
type: Property
comment: Headline of the article.
domainIncludes: CreativeWork
rangeIncludes: Text

primaryPrevention
type: Property
comment: A preventative therapy used to prevent an initial occurrence of the medical condition, such as vaccination.
domainIncludes: MedicalCondition
isPartOf: health-lifesci.schema.org
rangeIncludes: MedicalTherapy

ReturnInStore
type: ReturnMethodEnumeration
comment: Specifies that product returns must be made in a store.
isPartOf: pending.schema.org
source: https://github.com/schemaorg/schemaorg/issues/2880

blogPost
type: Property
comment: A posting that is part of this blog.
domainIncludes: Blog
rangeIncludes: BlogPosting

exceptDate
type: Property
comment: Defines a Date or DateTime during which a scheduled Event will not take place. The property allows exceptions to a Schedule to be specified. If an exception is specified as a DateTime then only the event that would have started at that specific date and time should be excluded from the schedule. If an exception is specified as a Date then any event that is scheduled for that 24 hour period should be excluded from the schedule. This allows a whole day to be excluded from the schedule without having to itemise every scheduled event.
domainIncludes: Schedule
isPartOf: pending.schema.org
rangeIncludes: DateTime
rangeIncludes: Date
source: https://github.com/schemaorg/schemaorg/issues/1457

fuelCapacity
type: Property
comment: The capacity of the fuel tank or in the case of electric cars, the battery. If there are multiple components for storage, this should indicate the total of all storage of the same type.\n\nTypical unit code(s): LTR for liters, GLL of US gallons, GLI for UK / imperial gallons, AMH for ampere-hours (for electrical vehicles).
contributor: Automotive Ontology Working Group
domainIncludes: Vehicle
isPartOf: auto.schema.org
rangeIncludes: QuantitativeValue

cvdNumBeds
type: Property
comment: numbeds - HOSPITAL INPATIENT BEDS: Inpatient beds, including all staffed, licensed, and overflow (surge) beds used for inpatients.
domainIncludes: CDCPMDRecord
isPartOf: pending.schema.org
rangeIncludes: Number
source: https://github.com/schemaorg/schemaorg/issues/2521

HalalDiet
type: RestrictedDiet
comment: A diet conforming to Islamic dietary practices.

ITVolunteerAssociationCharity
type: ITNonprofitType
comment: ITVolunteerAssociationCharity: Non-profit type referring to associations organising charitable volunteer activities (Ital. Organizzazioni di volontariato or ODV) according to Italian Law 266 of 1991.
isPartOf: pending.schema.org
source: https://github.com/schemaorg/schemaorg/issues/3629

TattooParlor
type: Class
comment: A tattoo parlor.
subclass of: HealthAndBeautyBusiness

WearableMeasurementCollar
type: WearableMeasurementTypeEnumeration
comment: Measurement of the collar, for example of a shirt.
isPartOf: pending.schema.org
source: https://github.com/schemaorg/schemaorg/issues/2811

ClothingStore
type: Class
comment: A clothing store.
subclass of: Store

emissionsCO2
type: Property
comment: The CO2 emissions in g/km. When used in combination with a QuantitativeValue, put "g/km" into the unitText property of that value, since there is no UN/CEFACT Common Code for "g/km".
contributor: Automotive Ontology Working Group
domainIncludes: Vehicle
isPartOf: auto.schema.org
rangeIncludes: Number

IncentiveQualifiedExpenseTypeUtilityBill
type: IncentiveQualifiedExpenseType
comment: This incentive applies to utility bills.
isPartOf: pending.schema.org
source: https://github.com/schemaorg/schemaorg/issues/3572

Guide
type: Class
comment: Guide is a page or article that recommends specific products or services, or aspects of a thing for a user to consider. A Guide may represent a Buying Guide and detail aspects of products or services for a user to consider. A Guide may represent a Product Guide and recommend specific products or services. A Guide may represent a Ranked List and recommend specific products or services with ranking.
subclass of: CreativeWork
isPartOf: pending.schema.org
source: https://github.com/schemaorg/schemaorg/issues/2405

MoveAction
type: Class
comment: The act of an agent relocating to a place.\n\nRelated actions:\n\n* TransferAction: Unlike TransferAction, the subject of the move is a living Person or Organization rather than an inanimate object.
subclass of: Action

MiddleSchool
type: Class
comment: A middle school (typically for children aged around 11-14, although this varies somewhat).
subclass of: EducationalOrganization

MovieSeries
type: Class
comment: A series of movies. Included movies can be indicated with the hasPart property.
subclass of: CreativeWorkSeries

priceCurrency
type: Property
comment: The currency of the price, or a price component when attached to PriceSpecification and its subtypes.\n\nUse standard formats: [ISO 4217 currency format](http://en.wikipedia.org/wiki/ISO_4217), e.g. "USD"; [Ticker symbol](https://en.wikipedia.org/wiki/List_of_cryptocurrencies) for cryptocurrencies, e.g. "BTC"; well known names for [Local Exchange Trading Systems](https://en.wikipedia.org/wiki/Local_exchange_trading_system) (LETS) and other currency types, e.g. "Ithaca HOUR".
sub property of: hasCurrency
domainIncludes: Ticket
domainIncludes: TradeAction
domainIncludes: DonateAction
domainIncludes: Offer
domainIncludes: Reservation
domainIncludes: PriceSpecification
rangeIncludes: Text

Cardiovascular
type: MedicalSpecialty
comment: A specific branch of medical science that pertains to diagnosis and treatment of disorders of heart and vasculature.
isPartOf: health-lifesci.schema.org

mainEntity
type: Property
comment: Indicates the primary entity described in some page or other CreativeWork.
sub property of: about
domainIncludes: CreativeWork
inverseOf: mainEntityOfPage
rangeIncludes: Thing

experienceInPlaceOfEducation
type: Property
comment: Indicates whether a JobPosting will accept experience (as indicated by OccupationalExperienceRequirements) in place of its formal educational qualifications (as indicated by educationRequirements). If true, indicates that satisfying one of these requirements is sufficient.
domainIncludes: JobPosting
isPartOf: pending.schema.org
rangeIncludes: Boolean
source: https://github.com/schemaorg/schemaorg/issues/2681

eligibleRegion
type: Property
comment: The ISO 3166-1 (ISO 3166-1 alpha-2) or ISO 3166-2 code, the place, or the GeoShape for the geo-political region(s) for which the offer or delivery charge specification is valid.\n\nSee also ineligibleRegion.
sub property of: areaServed
contributor: GoodRelationsTerms
domainIncludes: Demand
domainIncludes: Offer
domainIncludes: ActionAccessSpecification
domainIncludes: DeliveryChargeSpecification
rangeIncludes: Place
rangeIncludes: Text
rangeIncludes: GeoShape
source: https://github.com/schemaorg/schemaorg/issues/1741

Nonprofit501d
type: USNonprofitType
comment: Nonprofit501d: Non-profit type referring to Religious and Apostolic Associations.
isPartOf: pending.schema.org
source: https://github.com/schemaorg/schemaorg/issues/2543

LockerDelivery
type: DeliveryMethod
comment: A DeliveryMethod in which an item is made available via locker.

DownloadAction
type: Class
comment: The act of downloading an object.
subclass of: TransferAction

relatedTo
type: Property
comment: The most generic familial relation.
domainIncludes: Person
rangeIncludes: Person

RemixAlbum
type: MusicAlbumProductionType
comment: RemixAlbum.
contributor: MBZ

jurisdiction
type: Property
comment: Indicates a legal jurisdiction, e.g. of some legislation, or where some government service is based.
domainIncludes: Legislation
domainIncludes: GovernmentService
isPartOf: pending.schema.org
rangeIncludes: Text
rangeIncludes: AdministrativeArea
source: https://github.com/schemaorg/schemaorg/issues/2534

TradeAction
type: Class
comment: The act of participating in an exchange of goods and services for monetary compensation. An agent trades an object, product or service with a participant in exchange for a one time or periodic payment.
subclass of: Action

purchaseDate
type: Property
comment: The date the item, e.g. vehicle, was purchased by the current owner.
contributor: Automotive Ontology Working Group
domainIncludes: Product
domainIncludes: Vehicle
rangeIncludes: Date

founder
type: Property
comment: A person or organization who founded this organization.
domainIncludes: Organization
rangeIncludes: Organization
rangeIncludes: Person

StagesHealthAspect
type: HealthAspectEnumeration
comment: Stages that can be observed from a topic.
isPartOf: pending.schema.org
source: https://github.com/schemaorg/schemaorg/issues/2374

Table
type: Class
comment: A table on a Web page.
subclass of: WebPageElement

FulfillmentTypePickupDropoff
type: FulfillmentTypeEnumeration
comment: Fulfillment through pick-up drop-off locations.
isPartOf: pending.schema.org
source: https://github.com/schemaorg/schemaorg/issues/3617

timeOfDay
type: Property
comment: The time of day the program normally runs. For example, "evenings".
domainIncludes: EducationalOccupationalProgram
isPartOf: pending.schema.org
rangeIncludes: Text
source: https://github.com/schemaorg/schemaorg/issues/2419

ContactPointOption
type: Class
comment: Enumerated options related to a ContactPoint.
subclass of: Enumeration

returnPolicyCategory
type: Property
comment: Specifies an applicable return policy (from an enumeration).
domainIncludes: MerchantReturnPolicy
domainIncludes: MerchantReturnPolicySeasonalOverride
isPartOf: pending.schema.org
rangeIncludes: MerchantReturnEnumeration
source: https://github.com/schemaorg/schemaorg/issues/2288

spouse
type: Property
comment: The person's spouse.
domainIncludes: Person
rangeIncludes: Person

copyrightHolder
type: Property
comment: The party holding the legal copyright to the CreativeWork.
domainIncludes: CreativeWork
rangeIncludes: Organization
rangeIncludes: Person

agent
type: Property
comment: The direct performer or driver of the action (animate or inanimate). E.g. *John* wrote a book.
domainIncludes: Action
rangeIncludes: Organization
rangeIncludes: Person

UnclassifiedAdultConsideration
type: AdultOrientedEnumeration
comment: The item is suitable only for adults, without indicating why. Due to widespread use of "adult" as a euphemism for "sexual", many such items are likely suited also for the SexualContentConsideration code.
isPartOf: pending.schema.org
source: https://github.com/schemaorg/schemaorg/issues/2989

customerRemorseReturnLabelSource
type: Property
comment: The method (from an enumeration) by which the customer obtains a return shipping label for a product returned due to customer remorse.
domainIncludes: MerchantReturnPolicy
isPartOf: pending.schema.org
rangeIncludes: ReturnLabelSourceEnumeration
source: https://github.com/schemaorg/schemaorg/issues/2880

busNumber
type: Property
comment: The unique identifier for the bus.
domainIncludes: BusTrip
rangeIncludes: Text

foodEvent
type: Property
comment: A sub property of location. The specific food event where the action occurred.
sub property of: location
domainIncludes: CookAction
rangeIncludes: FoodEvent

BroadcastChannel
type: Class
comment: A unique instance of a BroadcastService on a CableOrSatelliteService lineup.
subclass of: Intangible

homeTeam
type: Property
comment: The home team in a sports event.
sub property of: competitor
domainIncludes: SportsEvent
rangeIncludes: SportsTeam
rangeIncludes: Person

greater
type: Property
comment: This ordering relation for qualitative values indicates that the subject is greater than the object.
contributor: GoodRelationsTerms
domainIncludes: QualitativeValue
rangeIncludes: QualitativeValue

PaymentMethodType
type: Class
comment: The type of payment method, only for generic payment types, specific forms of payments, like card payment should be expressed using subclasses of PaymentMethod.
subclass of: Enumeration
isPartOf: pending.schema.org
source: https://github.com/schemaorg/schemaorg/issues/3537

DangerousGoodConsideration
type: AdultOrientedEnumeration
comment: The item is dangerous and requires careful handling and/or special training of the user. See also the [UN Model Classification](https://unece.org/DAM/trans/danger/publi/unrec/rev17/English/02EREv17_Part2.pdf) defining the 9 classes of dangerous goods such as explosives, gases, flammables, and more.
isPartOf: pending.schema.org
source: https://github.com/schemaorg/schemaorg/issues/2989

DELimitedLiabilityCharity
type: DENonprofitType
comment: DELimitedLiabilityCharity: Non-profit type referring to a charitable Common Stock Company (German gGmbH or gemeinnützige Gesellschaft mit beschränkter Haftung) that has been recognized by the tax authorities as a charitable non-profit.
isPartOf: pending.schema.org
source: https://github.com/schemaorg/schemaorg/issues/3629

gracePeriod
type: Property
comment: The period of time after any due date that the borrower has to fulfil its obligations before a default (failure to pay) is deemed to have occurred.
contributor: FIBO
domainIncludes: LoanOrCredit
isPartOf: pending.schema.org
rangeIncludes: Duration
source: https://github.com/schemaorg/schemaorg/issues/1253

itemDefectReturnShippingFeesAmount
type: Property
comment: Amount of shipping costs for defect product returns. Applicable when property itemDefectReturnFees equals ReturnShippingFees.
domainIncludes: MerchantReturnPolicy
isPartOf: pending.schema.org
rangeIncludes: MonetaryAmount
source: https://github.com/schemaorg/schemaorg/issues/2880

digitalSourceType
type: Property
comment: Indicates an IPTCDigitalSourceEnumeration code indicating the nature of the digital source(s) for some CreativeWork.
domainIncludes: CreativeWork
isPartOf: pending.schema.org
rangeIncludes: IPTCDigitalSourceEnumeration
source: https://github.com/schemaorg/schemaorg/issues/3392

teaches
type: Property
comment: The item being described is intended to help a person learn the competency or learning outcome defined by the referenced term.
domainIncludes: EducationEvent
domainIncludes: LearningResource
domainIncludes: CreativeWork
isPartOf: pending.schema.org
rangeIncludes: DefinedTerm
rangeIncludes: Text
source: https://github.com/schemaorg/schemaorg/issues/2427

Casino
type: Class
comment: A casino.
subclass of: EntertainmentBusiness

ServicePeriod
type: Class
comment: ServicePeriod represents a duration with some constraints about cutoff time and business days. This is used e.g. in shipping for handling times or transit time.
subclass of: StructuredValue
isPartOf: pending.schema.org
source: https://github.com/schemaorg/schemaorg/issues/3617

PalliativeProcedure
type: Class
comment: A medical procedure intended primarily for palliative purposes, aimed at relieving the symptoms of an underlying health condition.
subclass of: MedicalProcedure
subclass of: MedicalTherapy
isPartOf: health-lifesci.schema.org

coach
type: Property
comment: A person that acts in a coaching role for a sports team.
domainIncludes: SportsTeam
rangeIncludes: Person

Plumber
type: Class
comment: A plumbing service.
subclass of: HomeAndConstructionBusiness

VideoGameClip
type: Class
comment: A short segment/part of a video game.
subclass of: Clip

bookEdition
type: Property
comment: The edition of the book.
domainIncludes: Book
rangeIncludes: Text

version
type: Property
comment: The version of the CreativeWork embodied by a specified resource.
domainIncludes: CreativeWork
rangeIncludes: Text
rangeIncludes: Number

amenityFeature
type: Property
comment: An amenity feature (e.g. a characteristic or service) of the Accommodation. This generic property does not make a statement about whether the feature is included in an offer for the main accommodation or available at extra costs.
contributor: STI Accommodation Ontology
domainIncludes: Place
domainIncludes: FloorPlan
domainIncludes: LodgingBusiness
domainIncludes: Accommodation
rangeIncludes: LocationFeatureSpecification

temporalCoverage
type: Property
equivalent property: temporal
comment: The temporalCoverage of a CreativeWork indicates the period that the content applies to, i.e. that it describes, either as a DateTime or as a textual string indicating a time period in [ISO 8601 time interval format](https://en.wikipedia.org/wiki/ISO_8601#Time_intervals). In the case of a Dataset it will typically indicate the relevant time period in a precise notation (e.g. for a 2011 census dataset, the year 2011 would be written "2011/2012"). Other forms of content, e.g. ScholarlyArticle, Book, TVSeries or TVEpisode, may indicate their temporalCoverage in broader terms - textually or via well-known URL. Written works such as books may sometimes have precise temporal coverage too, e.g. a work set in 1939 - 1945 can be indicated in ISO 8601 interval format format via "1939/1945". Open-ended date ranges can be written with ".." in place of the end date. For example, "2015-11/.." indicates a range beginning in November 2015 and with no specified final date. This is tentative and might be updated in future when ISO 8601 is officially updated.
domainIncludes: CreativeWork
rangeIncludes: Text
rangeIncludes: URL
rangeIncludes: DateTime

WearableMeasurementHips
type: WearableMeasurementTypeEnumeration
comment: Measurement of the hip section, for example of a skirt.
isPartOf: pending.schema.org
source: https://github.com/schemaorg/schemaorg/issues/2811

Organization
type: Class
equivalent class: Organization
comment: An organization such as a school, NGO, corporation, club, etc.
subclass of: Thing

MedicalAudienceType
type: Class
comment: Target audiences types for medical web pages. Enumerated type.
subclass of: MedicalEnumeration
isPartOf: health-lifesci.schema.org

pageEnd
type: Property
equivalent property: pageEnd
comment: The page on which the work ends; for example "138" or "xvi".
contributor: bibex
domainIncludes: Article
domainIncludes: PublicationIssue
domainIncludes: Chapter
domainIncludes: PublicationVolume
rangeIncludes: Integer
rangeIncludes: Text

eligibleTransactionVolume
type: Property
comment: The transaction volume, in a monetary unit, for which the offer or price specification is valid, e.g. for indicating a minimal purchasing volume, to express free shipping above a certain order volume, or to limit the acceptance of credit cards to purchases to a certain minimal amount.
contributor: GoodRelationsTerms
domainIncludes: Demand
domainIncludes: Offer
domainIncludes: PriceSpecification
rangeIncludes: PriceSpecification

BikeStore
type: Class
comment: A bike store.
subclass of: Store

free
type: Property
comment: A flag to signal that the item, event, or place is accessible for free.
domainIncludes: PublicationEvent
rangeIncludes: Boolean
supersededBy: isAccessibleForFree

LocationFeatureSpecification
type: Class
comment: Specifies a location feature by providing a structured value representing a feature of an accommodation as a property-value pair of varying degrees of formality.
subclass of: PropertyValue
contributor: STI Accommodation Ontology

streetAddress
type: Property
equivalent property: streetAddress
comment: The street address. For example, 1600 Amphitheatre Pkwy.
domainIncludes: PostalAddress
rangeIncludes: Text

cvdFacilityCounty
type: Property
comment: Name of the County of the NHSN facility that this data record applies to. Use cvdFacilityId to identify the facility. To provide other details, healthcareReportingData can be used on a Hospital entry.
domainIncludes: CDCPMDRecord
isPartOf: pending.schema.org
rangeIncludes: Text
source: https://github.com/schemaorg/schemaorg/issues/2521

accessModeSufficient
type: Property
comment: A list of single or combined access modes that are sufficient to understand all the intellectual content of a resource, including any adaptations. Values should be drawn from the [approved vocabulary](https://www.w3.org/2021/a11y-discov-vocab/latest/#accessModeSufficient-vocabulary).
domainIncludes: CreativeWork
rangeIncludes: ItemList
source: https://github.com/schemaorg/schemaorg/issues/1100

printSection
type: Property
comment: If this NewsArticle appears in print, this field indicates the print section in which the article appeared.
domainIncludes: NewsArticle
rangeIncludes: Text

WarrantyPromise
type: Class
comment: A structured value representing the duration and scope of services that will be provided to a customer free of charge in case of a defect or malfunction of a product.
subclass of: StructuredValue
subclass of: MutualContractualAgreement
contributor: good-relations-and-schema-org

hasMap
type: Property
comment: A URL to a map of the place.
domainIncludes: Place
rangeIncludes: URL
rangeIncludes: Map

CrossSectional
type: MedicalObservationalStudyDesign
comment: Studies carried out on pre-existing data (usually from 'snapshot' surveys), such as that collected by the Census Bureau. Sometimes called Prevalence Studies.
isPartOf: health-lifesci.schema.org

lyrics
type: Property
comment: The words in the song.
contributor: MBZ
domainIncludes: MusicComposition
rangeIncludes: CreativeWork

CampingPitch
type: Class
comment: A CampingPitch is an individual place for overnight stay in the outdoors, typically being part of a larger camping site, or Campground.\n\n In British English a campsite, or campground, is an area, usually divided into a number of pitches, where people can camp overnight using tents or camper vans or caravans; this British English use of the word is synonymous with the American English expression campground. In American English the term campsite generally means an area where an individual, family, group, or military unit can pitch a tent or park a camper; a campground may contain many campsites. (Source: Wikipedia, see [https://en.wikipedia.org/wiki/Campsite](https://en.wikipedia.org/wiki/Campsite).)\n\n See also the dedicated [document on the use of schema.org for marking up hotels and other forms of accommodations](/docs/hotels.html).
subclass of: Accommodation
contributor: STI Accommodation Ontology

clinicalPharmacology
type: Property
comment: Description of the absorption and elimination of drugs, including their concentration (pharmacokinetics, pK) and biological effects (pharmacodynamics, pD).
domainIncludes: Drug
isPartOf: health-lifesci.schema.org
rangeIncludes: Text

ccRecipient
type: Property
comment: A sub property of recipient. The recipient copied on a message.
sub property of: recipient
domainIncludes: Message
rangeIncludes: Organization
rangeIncludes: Person
rangeIncludes: ContactPoint

directors
type: Property
comment: A director of e.g. TV, radio, movie, video games etc. content. Directors can be associated with individual items or with a series, episode, clip.
domainIncludes: VideoObject
domainIncludes: VideoGame
domainIncludes: Episode
domainIncludes: Clip
domainIncludes: Movie
domainIncludes: MovieSeries
domainIncludes: VideoGameSeries
domainIncludes: RadioSeries
domainIncludes: TVSeries
rangeIncludes: Person
supersededBy: director

OpeningHoursSpecification
type: Class
comment: A structured value providing information about the opening hours of a place or a certain service inside a place.\n\n The place is __open__ if the opens property is specified, and __closed__ otherwise.\n\nIf the value for the closes property is less than the value for the opens property then the hour range is assumed to span over the next day.
subclass of: StructuredValue
contributor: good-relations-and-schema-org

HyperTocEntry
type: Class
comment: A HyperToEntry is an item within a HyperToc, which represents a hypertext table of contents for complex media objects, such as VideoObject, AudioObject. The media object itself is indicated using associatedMedia. Each section of interest within that content can be described with a HyperTocEntry, with associated startOffset and endOffset. When several entries are all from the same file, associatedMedia is used on the overarching HyperTocEntry; if the content has been split into multiple files, they can be referenced using associatedMedia on each HyperTocEntry.
subclass of: CreativeWork
isPartOf: pending.schema.org
source: https://github.com/schemaorg/schemaorg/issues/2766

arrivalStation
type: Property
comment: The station where the train trip ends.
domainIncludes: TrainTrip
rangeIncludes: TrainStation

accessibilityFeature
type: Property
comment: Content features of the resource, such as accessible media, alternatives and supported enhancements for accessibility. Values should be drawn from the [approved vocabulary](https://www.w3.org/2021/a11y-discov-vocab/latest/#accessibilityFeature-vocabulary).
domainIncludes: CreativeWork
rangeIncludes: Text

ratingCount
type: Property
comment: The count of total number of ratings.
domainIncludes: AggregateRating
rangeIncludes: Integer

valueRequired
type: Property
comment: Whether the property must be filled in to complete the action. Default is false.
domainIncludes: PropertyValueSpecification
rangeIncludes: Boolean

DefinedRegion
type: Class
comment: A DefinedRegion is a geographic area defined by potentially arbitrary (rather than political, administrative or natural geographical) criteria. Properties are provided for defining a region by reference to sets of postal codes. Examples: a delivery destination when shopping. Region where regional pricing is configured. Requirement 1: Country: US States: "NY", "CA" Requirement 2: Country: US PostalCode Set: { [94000-94585], [97000, 97999], [13000, 13599]} { [12345, 12345], [78945, 78945], } Region = state, canton, prefecture, autonomous community...
subclass of: Place
subclass of: StructuredValue
source: https://github.com/schemaorg/schemaorg/issues/2506

numTracks
type: Property
comment: The number of tracks in this album or playlist.
domainIncludes: MusicPlaylist
rangeIncludes: Integer

screenCount
type: Property
comment: The number of screens in the movie theater.
domainIncludes: MovieTheater
rangeIncludes: Number

DisagreeAction
type: Class
comment: The act of expressing a difference of opinion with the object. An agent disagrees to/about an object (a proposition, topic or theme) with participants.
subclass of: ReactAction

LymphaticVessel
type: Class
comment: A type of blood vessel that specifically carries lymph fluid unidirectionally toward the heart.
subclass of: Vessel
isPartOf: health-lifesci.schema.org

CompleteDataFeed
type: Class
comment: A CompleteDataFeed is a DataFeed whose standard representation includes content for every item currently in the feed. This is the equivalent of Atom's element as defined in Feed Paging and Archiving [RFC 5005](https://tools.ietf.org/html/rfc5005), for example (and as defined for Atom), when using data from a feed that represents a collection of items that varies over time (e.g. "Top Twenty Records") there is no need to have newer entries mixed in alongside older, obsolete entries. By marking this feed as a CompleteDataFeed, old entries can be safely discarded when the feed is refreshed, since we can assume the feed has provided descriptions for all current items.
subclass of: DataFeed
isPartOf: pending.schema.org
source: https://github.com/schemaorg/schemaorg/issues/1397

Schedule
type: Class
comment: A schedule defines a repeating time period used to describe a regularly occurring Event. At a minimum a schedule will specify repeatFrequency which describes the interval between occurrences of the event. Additional information can be provided to specify the schedule more precisely. This includes identifying the day(s) of the week or month when the recurring event will take place, in addition to its start and end time. Schedules may also have start and end dates to indicate when they are active, e.g. to define a limited calendar of events.
subclass of: Intangible
isPartOf: pending.schema.org
source: https://github.com/schemaorg/schemaorg/issues/1457

ArtGallery
type: Class
comment: An art gallery.
subclass of: EntertainmentBusiness

WebContent
type: Class
comment: WebContent is a type representing all WebPage, WebSite and WebPageElement content. It is sometimes the case that detailed distinctions between Web pages, sites and their parts are not always important or obvious. The WebContent type makes it easier to describe Web-addressable content without requiring such distinctions to always be stated. (The intent is that the existing types WebPage, WebSite and WebPageElement will eventually be declared as subtypes of WebContent.)
subclass of: CreativeWork
isPartOf: pending.schema.org
source: https://github.com/schemaorg/schemaorg/issues/2358

arterialBranch
type: Property
comment: The branches that comprise the arterial structure.
domainIncludes: Artery
isPartOf: health-lifesci.schema.org
rangeIncludes: AnatomicalStructure

SafetyHealthAspect
type: HealthAspectEnumeration
comment: Content about the safety-related aspects of a health topic.
isPartOf: pending.schema.org
source: https://github.com/schemaorg/schemaorg/issues/2799

realEstateAgent
type: Property
comment: A sub property of participant. The real estate agent involved in the action.
sub property of: participant
domainIncludes: RentAction
rangeIncludes: RealEstateAgent

eventStatus
type: Property
comment: An eventStatus of an event represents its status; particularly useful when an event is cancelled or rescheduled.
domainIncludes: Event
rangeIncludes: EventStatusType

EvidenceLevelA
type: MedicalEvidenceLevel
comment: Data derived from multiple randomized clinical trials or meta-analyses.
isPartOf: health-lifesci.schema.org

estimatedFlightDuration
type: Property
comment: The estimated time the flight will take.
domainIncludes: Flight
rangeIncludes: Duration
rangeIncludes: Text

remainingAttendeeCapacity
type: Property
comment: The number of attendee places for an event that remain unallocated.
domainIncludes: Event
rangeIncludes: Integer

RentAction
type: Class
comment: The act of giving money in return for temporary use, but not ownership, of an object such as a vehicle or property. For example, an agent rents a property from a landlord in exchange for a periodic payment.
subclass of: TradeAction

ticketToken
type: Property
comment: Reference to an asset (e.g., Barcode, QR code image or PDF) usable for entrance.
domainIncludes: Ticket
rangeIncludes: Text
rangeIncludes: URL

IncentiveQualifiedExpenseTypeGoodsOnly
type: IncentiveQualifiedExpenseType
comment: This incentive applies to goods only.
isPartOf: pending.schema.org
source: https://github.com/schemaorg/schemaorg/issues/3572

healthPlanPharmacyCategory
type: Property
comment: The category or type of pharmacy associated with this cost sharing.
domainIncludes: HealthPlanCostSharingSpecification
isPartOf: pending.schema.org
rangeIncludes: Text
source: https://github.com/schemaorg/schemaorg/issues/1062

VitalSign
type: Class
comment: Vital signs are measures of various physiological functions in order to assess the most basic body functions.
subclass of: MedicalSign
isPartOf: health-lifesci.schema.org

RentalCarReservation
type: Class
comment: A reservation for a rental car.\n\nNote: This type is for information about actual reservations, e.g. in confirmation emails or HTML pages with individual confirmations of reservations.
subclass of: Reservation

VideoGallery
type: Class
comment: Web page type: Video gallery page.
subclass of: MediaGallery

MobilePhoneStore
type: Class
comment: A store that sells mobile phones and related accessories.
subclass of: Store

multipleValues
type: Property
comment: Whether multiple values are allowed for the property. Default is false.
domainIncludes: PropertyValueSpecification
rangeIncludes: Boolean

defaultValue
type: Property
comment: The default value of the input. For properties that expect a literal, the default is a literal value, for properties that expect an object, it's an ID reference to one of the current values.
domainIncludes: PropertyValueSpecification
rangeIncludes: Text
rangeIncludes: Thing

isAcceptingNewPatients
type: Property
comment: Whether the provider is accepting new patients.
domainIncludes: MedicalOrganization
isPartOf: pending.schema.org
rangeIncludes: Boolean
source: https://github.com/schemaorg/schemaorg/issues/1062

ConferenceEvent
type: Class
comment: Event type: Conference event.
subclass of: Event
isPartOf: pending.schema.org
source: https://github.com/schemaorg/schemaorg/issues/4495

Midwifery
type: MedicalSpecialty
comment: A nurse-like health profession that deals with pregnancy, childbirth, and the postpartum period (including care of the newborn), besides sexual and reproductive health of women throughout their lives.
subclass of: MedicalBusiness
isPartOf: health-lifesci.schema.org

DiscussionForumPosting
type: Class
comment: A posting to a discussion forum.
subclass of: SocialMediaPosting

requiredMinAge
type: Property
comment: Audiences defined by a person's minimum age.
domainIncludes: PeopleAudience
rangeIncludes: Integer

EducationalOccupationalProgram
type: Class
comment: A program offered by an institution which determines the learning progress to achieve an outcome, usually a credential like a degree or certificate. This would define a discrete set of opportunities (e.g., job, courses) that together constitute a program with a clear start, end, set of requirements, and transition to a new occupational opportunity (e.g., a job), or sometimes a higher educational opportunity (e.g., an advanced degree).
subclass of: Intangible
isPartOf: pending.schema.org
source: https://github.com/schemaorg/schemaorg/issues/2289

InstantaneousEvent
type: Class
equivalent class: InstantaneousEvent
comment: An event with no duration, like for instance a computer log entry.
subclass of: StructuredValue
isPartOf: pending.schema.org
source: https://github.com/schemaorg/schemaorg/issues/4527

cvdNumC19MechVentPats
type: Property
comment: numc19mechventpats - HOSPITALIZED and VENTILATED: Patients hospitalized in an NHSN inpatient care location who have suspected or confirmed COVID-19 and are on a mechanical ventilator.
domainIncludes: CDCPMDRecord
isPartOf: pending.schema.org
rangeIncludes: Number
source: https://github.com/schemaorg/schemaorg/issues/2521

ElectronicsStore
type: Class
comment: An electronics store.
subclass of: Store

MerchantReturnUnspecified
type: MerchantReturnEnumeration
comment: Specifies that a product return policy is not provided.
isPartOf: pending.schema.org
source: https://github.com/schemaorg/schemaorg/issues/2288

dayOfWeek
type: Property
comment: The day of the week for which these opening hours are valid.
contributor: GoodRelationsTerms
domainIncludes: OpeningHoursSpecification
domainIncludes: EducationalOccupationalProgram
rangeIncludes: DayOfWeek

MedicalOrganization
type: Class
comment: A medical organization (physical or not), such as hospital, institution or clinic.
subclass of: Organization

sizeGroup
type: Property
comment: The size group (also known as "size type") for a product's size. Size groups are common in the fashion industry to define size segments and suggested audiences for wearable products. Multiple values can be combined, for example "men's big and tall", "petite maternity" or "regular".
domainIncludes: SizeSpecification
isPartOf: pending.schema.org
rangeIncludes: SizeGroupEnumeration
rangeIncludes: Text
source: https://github.com/schemaorg/schemaorg/issues/2811

programPrerequisites
type: Property
comment: Prerequisites for enrolling in the program.
domainIncludes: EducationalOccupationalProgram
isPartOf: pending.schema.org
rangeIncludes: EducationalOccupationalCredential
rangeIncludes: AlignmentObject
rangeIncludes: Course
rangeIncludes: Text
source: https://github.com/schemaorg/schemaorg/issues/2289

CookAction
type: Class
comment: The act of producing/preparing food.
subclass of: CreateAction

Lung
type: PhysicalExam
comment: Lung and respiratory system clinical examination.
isPartOf: health-lifesci.schema.org

AgreeAction
type: Class
comment: The act of expressing a consistency of opinion with the object. An agent agrees to/about an object (a proposition, topic or theme) with participants.
subclass of: ReactAction

departureBusStop
type: Property
comment: The stop or station from which the bus departs.
domainIncludes: BusTrip
rangeIncludes: BusStation
rangeIncludes: BusStop

floorSize
type: Property
comment: The size of the accommodation, e.g. in square meter or squarefoot. Typical unit code(s): MTK for square meter, FTK for square foot, or YDK for square yard.
contributor: STI Accommodation Ontology
domainIncludes: Accommodation
domainIncludes: FloorPlan
rangeIncludes: QuantitativeValue

permissions
type: Property
comment: Permission(s) required to run the app (for example, a mobile app may require full internet access or may run only on wifi).
domainIncludes: SoftwareApplication
rangeIncludes: Text

WearableSizeGroupBig
type: WearableSizeGroupEnumeration
comment: Size group "Big" for wearables.
isPartOf: pending.schema.org
source: https://github.com/schemaorg/schemaorg/issues/2811

inPlaylist
type: Property
comment: The playlist to which this recording belongs.
domainIncludes: MusicRecording
rangeIncludes: MusicPlaylist

MedicalConditionStage
type: Class
comment: A stage of a medical condition, such as 'Stage IIIa'.
subclass of: MedicalIntangible
isPartOf: health-lifesci.schema.org

gameAvailabilityType
type: Property
comment: Indicates the availability type of the game content associated with this action, such as whether it is a full version or a demo.
domainIncludes: PlayGameAction
isPartOf: pending.schema.org
rangeIncludes: GameAvailabilityEnumeration
rangeIncludes: Text
source: https://github.com/schemaorg/schemaorg/issues/3058

workPerformed
type: Property
comment: A work performed in some event, for example a play performed in a TheaterEvent.
sub property of: workFeatured
domainIncludes: Event
rangeIncludes: CreativeWork

floorLevel
type: Property
comment: The floor level for an Accommodation in a multi-storey building. Since counting systems [vary internationally](https://en.wikipedia.org/wiki/Storey#Consecutive_number_floor_designations), the local system should be used where possible.
domainIncludes: LocalBusiness
domainIncludes: Accommodation
domainIncludes: Residence
isPartOf: pending.schema.org
rangeIncludes: Text
source: https://github.com/schemaorg/schemaorg/issues/2373
source: https://github.com/schemaorg/schemaorg/issues/4469

credentialCategory
type: Property
comment: The category or type of credential being described, for example "degree”, “certificate”, “badge”, or more specific term.
domainIncludes: Credential
isPartOf: pending.schema.org
rangeIncludes: DefinedTerm
rangeIncludes: Text
rangeIncludes: URL
source: https://github.com/schemaorg/schemaorg/issues/1779

NonprofitANBI
type: NLNonprofitType
comment: NonprofitANBI: Non-profit type referring to a Public Benefit Organization (NL).
isPartOf: pending.schema.org
source: https://github.com/schemaorg/schemaorg/issues/2543

TrainTrip
type: Class
comment: A trip on a commercial train line.
subclass of: Trip

recordedAs
type: Property
comment: An audio recording of the work.
contributor: MBZ
domainIncludes: MusicComposition
inverseOf: recordingOf
rangeIncludes: MusicRecording

Festival
type: Class
comment: Event type: Festival.
subclass of: Event

valuePattern
type: Property
comment: Specifies a regular expression for testing literal values according to the HTML spec.
domainIncludes: PropertyValueSpecification
rangeIncludes: Text

trackingNumber
type: Property
comment: Shipper tracking number.
domainIncludes: ParcelDelivery
rangeIncludes: Text

ProductCollection
type: Class
comment: A set of products (either ProductGroups or specific variants) that are listed together e.g. in an Offer.
subclass of: Collection
subclass of: Product
isPartOf: pending.schema.org
source: https://github.com/schemaorg/schemaorg/issues/2597

Nonprofit501c27
type: USNonprofitType
comment: Nonprofit501c27: Non-profit type referring to State-Sponsored Workers' Compensation Reinsurance Organizations.
isPartOf: pending.schema.org
source: https://github.com/schemaorg/schemaorg/issues/2543

epidemiology
type: Property
comment: The characteristics of associated patients, such as age, gender, race etc.
domainIncludes: PhysicalActivity
domainIncludes: MedicalCondition
isPartOf: health-lifesci.schema.org
rangeIncludes: Text

doseSchedule
type: Property
comment: A dosing schedule for the drug for a given population, either observed, recommended, or maximum dose based on the type used.
domainIncludes: TherapeuticProcedure
domainIncludes: Drug
isPartOf: health-lifesci.schema.org
rangeIncludes: DoseSchedule

PriceComponentTypeEnumeration
type: Class
comment: Enumerates different price components that together make up the total price for an offered product.
subclass of: Enumeration
isPartOf: pending.schema.org
source: https://github.com/schemaorg/schemaorg/issues/2689

Monday
type: DayOfWeek
comment: The day of the week between Sunday and Tuesday.

ContactPoint
type: Class
equivalent class: ContactPoint
equivalent class: VCard
comment: A contact point—for example, a Customer Complaints department.
subclass of: StructuredValue

hiringOrganization
type: Property
comment: Organization or Person offering the job position.
domainIncludes: JobPosting
rangeIncludes: Organization
rangeIncludes: Person

prescribingInfo
type: Property
comment: Link to prescribing information for the drug.
domainIncludes: Drug
isPartOf: health-lifesci.schema.org
rangeIncludes: URL

eligibleWithSupplier
type: Property
comment: The supplier of the incentivized item/service for which the incentive is valid for such as a utility company, merchant, or contractor.
domainIncludes: FinancialIncentive
isPartOf: pending.schema.org
rangeIncludes: Organization
source: https://github.com/schemaorg/schemaorg/issues/3572

BusinessEntityType
type: Class
comment: A business entity type is a conceptual entity representing the legal form, the size, the main line of business, the position in the value chain, or any combination thereof, of an organization or business person.\n\nCommonly used values:\n\n* http://purl.org/goodrelations/v1#Business\n* http://purl.org/goodrelations/v1#Enduser\n* http://purl.org/goodrelations/v1#PublicInstitution\n* http://purl.org/goodrelations/v1#Reseller
subclass of: Enumeration
contributor: good-relations-and-schema-org

Emergency
type: MedicalSpecialty
comment: A specific branch of medical science that deals with the evaluation and initial treatment of medical conditions caused by trauma or sudden illness.
subclass of: MedicalBusiness
isPartOf: health-lifesci.schema.org

PoliticalParty
type: Class
comment: Organization: Political Party.
subclass of: Organization
source: https://github.com/schemaorg/schemaorg/issues/3282

biomechnicalClass
type: Property
comment: The biomechanical properties of the bone.
domainIncludes: Joint
isPartOf: health-lifesci.schema.org
rangeIncludes: Text

DigitalDocumentPermissionType
type: Class
comment: A type of permission which can be granted for accessing a digital document.
subclass of: Enumeration

OperatingSystem
type: Class
comment: System software that manages computer hardware and software resources, and provides common services for computer programs.
subclass of: SoftwareApplication
isPartOf: pending.schema.org
source: https://github.com/schemaorg/schemaorg/issues/4575

MaximumDoseSchedule
type: Class
comment: The maximum dosing schedule considered safe for a drug or supplement as recommended by an authority or by the drug/supplement's manufacturer. Capture the recommending authority in the recognizingAuthority property of MedicalEntity.
subclass of: DoseSchedule
isPartOf: health-lifesci.schema.org

DoseSchedule
type: Class
comment: A specific dosing schedule for a drug or supplement.
subclass of: MedicalIntangible
isPartOf: health-lifesci.schema.org

permitAudience
type: Property
comment: The target audience for this permit.
domainIncludes: Permit
rangeIncludes: Audience

circle
type: Property
comment: A circle is the circular region of a specified radius centered at a specified latitude and longitude. A circle is expressed as a pair followed by a radius in meters.
domainIncludes: GeoShape
rangeIncludes: Text

IncentiveTypeTaxDeduction
type: IncentiveType
comment: An incentive that reduces the recipient's amount of taxable income.
isPartOf: pending.schema.org
source: https://github.com/schemaorg/schemaorg/issues/3572

studyLocation
type: Property
comment: The location in which the study is taking/took place.
domainIncludes: MedicalStudy
isPartOf: health-lifesci.schema.org
rangeIncludes: AdministrativeArea

cheatCode
type: Property
comment: Cheat codes to the game.
domainIncludes: VideoGameSeries
domainIncludes: VideoGame
rangeIncludes: CreativeWork

labelDetails
type: Property
comment: Link to the drug's label details.
domainIncludes: Drug
isPartOf: health-lifesci.schema.org
rangeIncludes: URL

SeatingMap
type: MapCategoryType
comment: A seating map.

billingAddress
type: Property
equivalent property: BillingAddress
comment: The billing address for the order.
domainIncludes: Order
rangeIncludes: PostalAddress

parentTaxon
type: Property
comment: Closest parent taxon of the taxon in question.
domainIncludes: Taxon
inverseOf: childTaxon
isPartOf: pending.schema.org
rangeIncludes: Text
rangeIncludes: URL
rangeIncludes: Taxon
source: Taxon

EnergyStarCertified
type: EnergyStarEnergyEfficiencyEnumeration
comment: Represents EnergyStar certification.
isPartOf: pending.schema.org
source: https://github.com/schemaorg/schemaorg/issues/2670

dataFeedElement
type: Property
comment: An item within a data feed. Data feeds may have many elements.
domainIncludes: DataFeed
rangeIncludes: Text
rangeIncludes: DataFeedItem
rangeIncludes: Thing

awayTeam
type: Property
comment: The away team in a sports event.
sub property of: competitor
domainIncludes: SportsEvent
rangeIncludes: SportsTeam
rangeIncludes: Person

positiveNotes
type: Property
comment: Provides positive considerations regarding something, for example product highlights or (alongside negativeNotes) pro/con lists for reviews. In the case of a Review, the property describes the itemReviewed from the perspective of the review; in the case of a Product, the product itself is being described. The property values can be expressed either as unstructured text (repeated as necessary), or if ordered, as a list (in which case the most positive is at the beginning of the list).
domainIncludes: Product
domainIncludes: Review
isPartOf: pending.schema.org
rangeIncludes: WebContent
rangeIncludes: ItemList
rangeIncludes: ListItem
rangeIncludes: Text
source: https://github.com/schemaorg/schemaorg/issues/2832

governmentBenefitsInfo
type: Property
comment: governmentBenefitsInfo provides information about government benefits associated with a SpecialAnnouncement.
domainIncludes: SpecialAnnouncement
isPartOf: pending.schema.org
rangeIncludes: GovernmentService
source: https://github.com/schemaorg/schemaorg/issues/2534

serviceLocation
type: Property
comment: The location (e.g. civic structure, local business, etc.) where a person can go to access the service.
domainIncludes: ServiceChannel
rangeIncludes: Place

SingleRelease
type: MusicAlbumReleaseType
comment: SingleRelease.
contributor: MBZ

offers
type: Property
equivalent property: isProductOf
comment: An offer to provide this item—for example, an offer to sell a product, rent the DVD of a movie, perform a service, or give away tickets to an event. Use businessFunction to indicate the kind of transaction offered, i.e. sell, lease, etc. This property can also be used to describe a Demand. While this property is listed as expected on a number of common types, it can be used in others. In that case, using a second type, such as Product or a subtype of Product, can clarify the nature of the offer.
domainIncludes: CreativeWork
domainIncludes: Product
domainIncludes: Service
domainIncludes: AggregateOffer
domainIncludes: EducationalOccupationalProgram
domainIncludes: MenuItem
domainIncludes: Trip
domainIncludes: Event
inverseOf: itemOffered
rangeIncludes: Offer
rangeIncludes: Demand
source: https://github.com/schemaorg/schemaorg/issues/2289

MediaEnumeration
type: Class
comment: MediaEnumeration enumerations are lists of codes, labels etc. useful for describing media objects. They may be reflections of externally developed lists, or created at schema.org, or a combination.
subclass of: Enumeration
isPartOf: pending.schema.org
source: https://github.com/schemaorg/schemaorg/issues/3392

payload
type: Property
comment: The permitted weight of passengers and cargo, EXCLUDING the weight of the empty vehicle.\n\nTypical unit code(s): KGM for kilogram, LBR for pound\n\n* Note 1: Many databases specify the permitted TOTAL weight instead, which is the sum of weight and payload\n* Note 2: You can indicate additional information in the name of the QuantitativeValue node.\n* Note 3: You may also link to a QualitativeValue node that provides additional information using valueReference.\n* Note 4: Note that you can use minValue and maxValue to indicate ranges.
contributor: Automotive Ontology Working Group
domainIncludes: Vehicle
isPartOf: auto.schema.org
rangeIncludes: QuantitativeValue

measurementDenominator
type: Property
comment: Identifies the denominator variable when an observation represents a ratio or percentage.
domainIncludes: Observation
domainIncludes: StatisticalVariable
isPartOf: pending.schema.org
rangeIncludes: StatisticalVariable
source: https://github.com/schemaorg/schemaorg/issues/2564

contactOption
type: Property
comment: An option available on this contact point (e.g. a toll-free number or support for hearing-impaired callers).
domainIncludes: ContactPoint
rangeIncludes: ContactPointOption

departureAirport
type: Property
comment: The airport where the flight originates.
domainIncludes: Flight
rangeIncludes: Airport

MusicVenue
type: Class
comment: A music venue.
subclass of: CivicStructure

WarrantyScope
type: Class
comment: A range of services that will be provided to a customer free of charge in case of a defect or malfunction of a product.\n\nCommonly used values:\n\n* http://purl.org/goodrelations/v1#Labor-BringIn\n* http://purl.org/goodrelations/v1#PartsAndLabor-BringIn\n* http://purl.org/goodrelations/v1#PartsAndLabor-PickUp
subclass of: Enumeration
contributor: good-relations-and-schema-org

monthsOfExperience
type: Property
comment: Indicates the minimal number of months of experience required for a position.
domainIncludes: OccupationalExperienceRequirements
isPartOf: pending.schema.org
rangeIncludes: Number
source: https://github.com/schemaorg/schemaorg/issues/2681

shippingOrigin
type: Property
equivalent property: DespatchLocation
comment: Indicates the origin of a shipment, i.e. where it should be coming from.
sub property of: hasLocation
domainIncludes: OfferShippingDetails
domainIncludes: ShippingConditions
rangeIncludes: DefinedRegion
source: https://github.com/schemaorg/schemaorg/issues/3122
source: https://github.com/schemaorg/schemaorg/issues/3617

itemDefectReturnFees
type: Property
comment: The type of return fees for returns of defect products.
domainIncludes: MerchantReturnPolicy
isPartOf: pending.schema.org
rangeIncludes: ReturnFeesEnumeration
source: https://github.com/schemaorg/schemaorg/issues/2880

dateRead
type: Property
comment: The date/time at which the message has been read by the recipient if a single recipient exists.
domainIncludes: Message
rangeIncludes: DateTime
rangeIncludes: Date

productionCompany
type: Property
comment: The production company or studio responsible for the item, e.g. series, video game, episode etc.
domainIncludes: MediaObject
domainIncludes: RadioSeries
domainIncludes: TVSeries
domainIncludes: Episode
domainIncludes: CreativeWorkSeason
domainIncludes: MovieSeries
domainIncludes: Movie
domainIncludes: VideoGameSeries
rangeIncludes: Organization

SizeSpecification
type: Class
comment: Size related properties of a product, typically a size code (name) and optionally a sizeSystem, sizeGroup, and product measurements (hasMeasurement). In addition, the intended audience can be defined through suggestedAge, suggestedGender, and suggested body measurements (suggestedMeasurement).
subclass of: QualitativeValue
isPartOf: pending.schema.org
source: https://github.com/schemaorg/schemaorg/issues/2811

relevantOccupation
type: Property
comment: The Occupation for the JobPosting.
domainIncludes: JobPosting
rangeIncludes: Occupation
source: https://github.com/schemaorg/schemaorg/issues/1698

subReservation
type: Property
comment: The individual reservations included in the package. Typically a repeated property.
domainIncludes: ReservationPackage
rangeIncludes: Reservation

department
type: Property
comment: A relationship between an organization and a department of that organization, also described as an organization (allowing different urls, logos, opening hours). For example: a store with a pharmacy, or a bakery with a cafe.
domainIncludes: Organization
rangeIncludes: Organization

ConfirmAction
type: Class
comment: The act of notifying someone that a future event/action is going to happen as expected.\n\nRelated actions:\n\n* CancelAction: The antonym of ConfirmAction.
subclass of: InformAction

LegalService
type: Class
comment: A LegalService is a business that provides legally-oriented services, advice and representation, e.g. law firms.\n\nAs a LocalBusiness it can be described as a provider of one or more Service\(s).
subclass of: LocalBusiness

MapCategoryType
type: Class
comment: An enumeration of several kinds of Map.
subclass of: Enumeration

messageAttachment
type: Property
comment: A CreativeWork attached to the message.
domainIncludes: Message
rangeIncludes: CreativeWork

foundingLocation
type: Property
comment: The place where the Organization was founded.
domainIncludes: Organization
rangeIncludes: Place

BackgroundNewsArticle
type: Class
comment: A NewsArticle providing historical context, definition and detail on a specific topic (aka "explainer" or "backgrounder"). For example, an in-depth article or frequently-asked-questions ([FAQ](https://en.wikipedia.org/wiki/FAQ)) document on topics such as Climate Change or the European Union. Other kinds of background material from a non-news setting are often described using Book or Article, in particular ScholarlyArticle. See also NewsArticle for related vocabulary from a learning/education perspective.
subclass of: NewsArticle
contributor: TP
isPartOf: pending.schema.org
source: https://github.com/schemaorg/schemaorg/issues/1525

expectedPrognosis
type: Property
comment: The likely outcome in either the short term or long term of the medical condition.
domainIncludes: MedicalCondition
isPartOf: health-lifesci.schema.org
rangeIncludes: Text

scheduleTimezone
type: Property
comment: Indicates the timezone for which the time(s) indicated in the Schedule are given. The value provided should be among those listed in the IANA Time Zone Database.
domainIncludes: Schedule
isPartOf: pending.schema.org
rangeIncludes: Text
source: https://github.com/schemaorg/schemaorg/issues/1457

paymentDue
type: Property
equivalent property: PaymentDueDate
comment: The date that payment is due.
sub property of: hasPaymentDueDate
domainIncludes: Invoice
domainIncludes: Order
rangeIncludes: DateTime
supersededBy: paymentDueDate

eventSchedule
type: Property
comment: Associates an Event with a Schedule. There are circumstances where it is preferable to share a schedule for a series of repeating events rather than data on the individual events themselves. For example, a website or application might prefer to publish a schedule for a weekly gym class rather than provide data on every event. A schedule could be processed by applications to add forthcoming events to a calendar. An Event that is associated with a Schedule using this property should not have startDate or endDate properties. These are instead defined within the associated Schedule, this avoids any ambiguity for clients using the data. The property might have repeated values to specify different schedules, e.g. for different months or seasons.
domainIncludes: Event
isPartOf: pending.schema.org
rangeIncludes: Schedule
source: https://github.com/schemaorg/schemaorg/issues/1457

geoWithin
type: Property
comment: Represents a relationship between two geometries (or the places they represent), relating a geometry to one that contains it, i.e. it is inside (i.e. within) its interior. As defined in [DE-9IM](https://en.wikipedia.org/wiki/DE-9IM).
domainIncludes: GeospatialGeometry
domainIncludes: Place
rangeIncludes: GeospatialGeometry
rangeIncludes: Place

ReportedDoseSchedule
type: Class
comment: A patient-reported or observed dosing schedule for a drug or supplement.
subclass of: DoseSchedule
isPartOf: health-lifesci.schema.org

Flight
type: Class
comment: An airline flight.
subclass of: Trip

educationalCredentialAwarded
type: Property
comment: A description of the qualification, award, certificate, diploma or other educational credential awarded as a consequence of successful completion of this course or program.
domainIncludes: EducationalOccupationalProgram
domainIncludes: Course
rangeIncludes: Text
rangeIncludes: URL
rangeIncludes: EducationalOccupationalCredential
source: https://github.com/schemaorg/schemaorg/issues/2289

DefinedTermSet
type: Class
comment: A set of defined terms, for example a set of categories or a classification scheme, a glossary, dictionary or enumeration. Use the about property to specify what the term set is about.
subclass of: CreativeWork
isPartOf: pending.schema.org
source: https://github.com/schemaorg/schemaorg/issues/894

programMembershipUsed
type: Property
comment: Any membership in a frequent flyer, hotel loyalty program, etc. being applied to the reservation.
domainIncludes: Reservation
rangeIncludes: ProgramMembership

numberOfLoanPayments
type: Property
comment: The number of payments contractually required at origination to repay the loan. For monthly paying loans this is the number of months from the contractual first payment date to the maturity date.
contributor: FIBO
domainIncludes: RepaymentSpecification
isPartOf: pending.schema.org
rangeIncludes: Number
source: https://github.com/schemaorg/schemaorg/issues/1253

evidenceOrigin
type: Property
comment: Source of the data used to formulate the guidance, e.g. RCT, consensus opinion, etc.
domainIncludes: MedicalGuideline
isPartOf: health-lifesci.schema.org
rangeIncludes: Text

WorkersUnion
type: Class
comment: A Workers Union (also known as a Labor Union, Labour Union, or Trade Union) is an organization that promotes the interests of its worker members by collectively bargaining with management, organizing, and political lobbying.
subclass of: Organization
source: https://github.com/schemaorg/schemaorg/issues/243

provider
type: Property
equivalent property: ServiceProvider
comment: The service provider, service operator, or service performer; the goods producer. Another party (a seller) may offer those services or goods on behalf of the provider. A provider may also serve as the seller.
domainIncludes: Service
domainIncludes: CreativeWork
domainIncludes: FinancialIncentive
domainIncludes: EducationalOccupationalProgram
domainIncludes: ParcelDelivery
domainIncludes: Invoice
domainIncludes: Reservation
domainIncludes: Action
domainIncludes: Trip
isPartOf: pending.schema.org
rangeIncludes: Organization
rangeIncludes: Person
source: https://github.com/schemaorg/schemaorg/issues/2927
source: https://github.com/schemaorg/schemaorg/issues/2289

TakeAction
type: Class
comment: The act of gaining ownership of an object from an origin. Reciprocal of GiveAction.\n\nRelated actions:\n\n* GiveAction: The reciprocal of TakeAction.\n* ReceiveAction: Unlike ReceiveAction, TakeAction implies that ownership has been transferred.
subclass of: TransferAction

Physiotherapy
type: MedicalSpecialty
comment: The practice of treatment of disease, injury, or deformity by physical methods such as massage, heat treatment, and exercise rather than by drugs or surgery.
subclass of: MedicalBusiness
isPartOf: health-lifesci.schema.org

spatialCoverage
type: Property
equivalent property: spatial
comment: The spatialCoverage of a CreativeWork indicates the place(s) which are the focus of the content. It is a subproperty of contentLocation intended primarily for more technical and detailed materials. For example with a Dataset, it indicates areas that the dataset describes: a dataset of New York weather would have spatialCoverage which was the place: the state of New York.
sub property of: contentLocation
domainIncludes: CreativeWork
rangeIncludes: Place

dateSent
type: Property
comment: The date/time at which the message was sent.
domainIncludes: Message
rangeIncludes: DateTime

MedicalStudy
type: Class
comment: A medical study is an umbrella type covering all kinds of research studies relating to human medicine or health, including observational studies and interventional trials and registries, randomized, controlled or not. When the specific type of study is known, use one of the extensions of this type, such as MedicalTrial or MedicalObservationalStudy. Also, note that this type should be used to mark up data that describes the study itself; to tag an article that publishes the results of a study, use MedicalScholarlyArticle. Note: use the code property of MedicalEntity to store study IDs, e.g. clinicaltrials.gov ID.
subclass of: MedicalEntity
isPartOf: health-lifesci.schema.org

numChildren
type: Property
comment: The number of children staying in the unit.
domainIncludes: LodgingReservation
rangeIncludes: Integer
rangeIncludes: QuantitativeValue

exerciseCourse
type: Property
comment: A sub property of location. The course where this action was taken.
sub property of: location
domainIncludes: ExerciseAction
rangeIncludes: Place

departureGate
type: Property
comment: Identifier of the flight's departure gate.
domainIncludes: Flight
rangeIncludes: Text

GamePlayMode
type: Class
comment: Indicates whether this game is multi-player, co-op or single-player.
subclass of: Enumeration

WorkBasedProgram
type: Class
comment: A program with both an educational and employment component. Typically based at a workplace and structured around work-based learning, with the aim of instilling competencies related to an occupation. WorkBasedProgram is used to distinguish programs such as apprenticeships from school, college or other classroom based educational programs.
subclass of: EducationalOccupationalProgram
isPartOf: pending.schema.org
source: https://github.com/schemaorg/schemaorg/issues/2289

SingleBlindedTrial
type: MedicalTrialDesign
comment: A trial design in which the researcher knows which treatment the patient was randomly assigned to but the patient does not.
isPartOf: health-lifesci.schema.org

MediaObject
type: Class
comment: A media object, such as an image, video, audio, or text object embedded in a web page or a downloadable dataset i.e. DataDownload. Note that a creative work may have many media objects associated with it on the same web page. For example, a page about a single song (MusicRecording) may have a music video (VideoObject), and a high and low bandwidth audio stream (2 AudioObject's).
subclass of: CreativeWork

SocialEvent
type: Class
comment: Event type: Social event.
subclass of: Event

diseasePreventionInfo
type: Property
comment: Information about disease prevention.
domainIncludes: SpecialAnnouncement
isPartOf: pending.schema.org
rangeIncludes: WebContent
rangeIncludes: URL
source: https://github.com/schemaorg/schemaorg/issues/2490

DEFoundationCharity
type: DENonprofitType
comment: DEFoundationCharity: Non-profit type referring to a charitable Foundation (German Stiftung) that has been recognized by the tax authorities as a charitable non-profit.
isPartOf: pending.schema.org
source: https://github.com/schemaorg/schemaorg/issues/3629

geoCovers
type: Property
comment: Represents a relationship between two geometries (or the places they represent), relating a covering geometry to a covered geometry. "Every point of b is a point of (the interior or boundary of) a". As defined in [DE-9IM](https://en.wikipedia.org/wiki/DE-9IM).
domainIncludes: GeospatialGeometry
domainIncludes: Place
rangeIncludes: GeospatialGeometry
rangeIncludes: Place

Recipe
type: Class
comment: A recipe. For dietary restrictions covered by the recipe, a few common restrictions are enumerated via suitableForDiet. The keywords property can also be used to add more detail.
subclass of: HowTo

SendAction
type: Class
comment: The act of physically/electronically dispatching an object for transfer from an origin to a destination. Related actions:\n\n* ReceiveAction: The reciprocal of SendAction.\n* GiveAction: Unlike GiveAction, SendAction does not imply the transfer of ownership (e.g. I can send you my laptop, but I'm not necessarily giving it to you).
subclass of: TransferAction

CoverArt
type: Class
comment: The artwork on the outer surface of a CreativeWork.
subclass of: VisualArtwork
isPartOf: bib.schema.org

ConvenienceStore
type: Class
comment: A convenience store.
subclass of: Store

FundingAgency
type: Class
comment: A FundingAgency is an organization that implements one or more FundingSchemes and manages the granting process (via Grants, typically MonetaryGrants). A funding agency is not always required for grant funding, e.g. philanthropic giving, corporate sponsorship etc. Examples of funding agencies include ERC, REA, NIH, Bill and Melinda Gates Foundation, ...
subclass of: Project
isPartOf: pending.schema.org
source: https://github.com/schemaorg/schemaorg/issues/383

IncentiveStatusRetired
type: IncentiveStatus
comment: This incentive is not longer available.
isPartOf: pending.schema.org
source: https://github.com/schemaorg/schemaorg/issues/3572

healthPlanDrugOption
type: Property
comment: TODO.
domainIncludes: HealthInsurancePlan
isPartOf: pending.schema.org
rangeIncludes: Text
source: https://github.com/schemaorg/schemaorg/issues/1062

transitTime
type: Property
comment: The typical delay the order has been sent for delivery and the goods reach the final customer. In the context of ShippingDeliveryTime, use the QuantitativeValue. Typical properties: minValue, maxValue, unitCode (d for DAY). In the context of ShippingConditions, use the ServicePeriod. It has a duration (as a QuantitativeValue) and also business days and a cut-off time.
domainIncludes: ShippingConditions
domainIncludes: ShippingDeliveryTime
rangeIncludes: QuantitativeValue
rangeIncludes: ServicePeriod
source: https://github.com/schemaorg/schemaorg/issues/2506
source: https://github.com/schemaorg/schemaorg/issues/3617

recognizingAuthority
type: Property
comment: If applicable, the organization that officially recognizes this entity as part of its endorsed system of medicine.
domainIncludes: MedicalEntity
isPartOf: health-lifesci.schema.org
rangeIncludes: Organization

significantLink
type: Property
comment: One of the more significant URLs on the page. Typically, these are the non-navigation links that are clicked on the most.
domainIncludes: WebPage
rangeIncludes: URL

CreateAction
type: Class
comment: The act of deliberately creating/producing/generating/building a result out of the agent.
subclass of: Action

PhysiciansOffice
type: Class
comment: A doctor's office or clinic.
subclass of: Physician

ComicIssue
type: Class
comment: Individual comic issues are serially published as part of a larger series. For the sake of consistency, even one-shot issues belong to a series comprised of a single issue. All comic issues can be uniquely identified by: the combination of the name and volume number of the series to which the issue belongs; the issue number; and the variant description of the issue (if any).
subclass of: PublicationIssue
isPartOf: bib.schema.org

TireShop
type: Class
comment: A tire shop.
subclass of: Store

availableFrom
type: Property
comment: When the item is available for pickup from the store, locker, etc.
domainIncludes: DeliveryEvent
rangeIncludes: DateTime

Apartment
type: Class
comment: An apartment (in American English) or flat (in British English) is a self-contained housing unit (a type of residential real estate) that occupies only part of a building (source: Wikipedia, the free encyclopedia, see http://en.wikipedia.org/wiki/Apartment).
subclass of: Accommodation
contributor: STI Accommodation Ontology

proprietaryName
type: Property
comment: Proprietary name given to the diet plan, typically by its originator or creator.
domainIncludes: Drug
domainIncludes: DietarySupplement
isPartOf: health-lifesci.schema.org
rangeIncludes: Text

percentile90
type: Property
comment: The 90th percentile value.
domainIncludes: QuantitativeValueDistribution
rangeIncludes: Number
source: https://github.com/schemaorg/schemaorg/issues/1698

nationality
type: Property
comment: Nationality of the person.
domainIncludes: Person
rangeIncludes: Country

gameEdition
type: Property
comment: The edition of a video game.
domainIncludes: VideoGame
rangeIncludes: Text

AdultEntertainment
type: Class
comment: An adult entertainment establishment.
subclass of: EntertainmentBusiness

recipeYield
type: Property
comment: The quantity produced by the recipe (for example, number of people served, number of servings, etc).
sub property of: yield
domainIncludes: Recipe
rangeIncludes: Text
rangeIncludes: QuantitativeValue

flightNumber
type: Property
comment: The unique identifier for a flight including the airline IATA code. For example, if describing United flight 110, where the IATA code for United is 'UA', the flightNumber is 'UA110'.
sub property of: identifier
domainIncludes: Flight
rangeIncludes: Text

bccRecipient
type: Property
comment: A sub property of recipient. The recipient blind copied on a message.
sub property of: recipient
domainIncludes: Message
rangeIncludes: Organization
rangeIncludes: Person
rangeIncludes: ContactPoint

coverageStartTime
type: Property
comment: The time when the live blog will begin covering the Event. Note that coverage may begin before the Event's start time. The LiveBlogPosting may also be created before coverage begins.
domainIncludes: LiveBlogPosting
rangeIncludes: DateTime

DayOfWeek
type: Class
comment: The day of the week, e.g. used to specify to which day the opening hours of an OpeningHoursSpecification refer. Originally, URLs from [GoodRelations](http://purl.org/goodrelations/v1) were used (for Monday, Tuesday, Wednesday, Thursday, Friday, Saturday, Sunday plus a special entry for PublicHolidays); these have now been integrated directly into schema.org.
subclass of: Enumeration
contributor: good-relations-and-schema-org

Playground
type: Class
comment: A playground.
subclass of: CivicStructure

applicableLocation
type: Property
comment: The location in which the status applies.
domainIncludes: DrugLegalStatus
domainIncludes: DrugCost
isPartOf: health-lifesci.schema.org
rangeIncludes: AdministrativeArea

MedicalSymptom
type: Class
comment: Any complaint sensed and expressed by the patient (therefore defined as subjective) like stomachache, lower-back pain, or fatigue.
subclass of: MedicalSignOrSymptom
isPartOf: health-lifesci.schema.org

syllabusSections
type: Property
comment: Indicates (typically several) Syllabus entities that lay out what each section of the overall course will cover.
domainIncludes: Course
isPartOf: pending.schema.org
rangeIncludes: Syllabus
source: https://github.com/schemaorg/schemaorg/issues/3281

MenuItem
type: Class
comment: A food or drink item listed in a menu or menu section.
subclass of: Intangible

SeekToAction
type: Class
comment: This is the Action of navigating to a specific startOffset timestamp within a VideoObject, typically represented with a URL template structure.
subclass of: Action
isPartOf: pending.schema.org
source: https://github.com/schemaorg/schemaorg/issues/2722

ingredients
type: Property
comment: A single ingredient used in the recipe, e.g. sugar, flour or garlic.
sub property of: supply
domainIncludes: Recipe
rangeIncludes: Text
supersededBy: recipeIngredient

VacationRental
type: Class
comment: A kind of lodging business that focuses on renting single properties for limited time.
subclass of: LodgingBusiness

measurementMethod
type: Property
comment: A subproperty of measurementTechnique that can be used for specifying specific methods, in particular via MeasurementMethodEnum.
sub property of: measurementTechnique
domainIncludes: DataCatalog
domainIncludes: StatisticalVariable
domainIncludes: Dataset
domainIncludes: PropertyValue
domainIncludes: DataDownload
domainIncludes: Observation
isPartOf: pending.schema.org
rangeIncludes: Text
rangeIncludes: URL
rangeIncludes: MeasurementMethodEnum
rangeIncludes: DefinedTerm
source: https://github.com/schemaorg/schemaorg/issues/1425

secondaryPrevention
type: Property
comment: A preventative therapy used to prevent reoccurrence of the medical condition after an initial episode of the condition.
domainIncludes: MedicalCondition
isPartOf: health-lifesci.schema.org
rangeIncludes: DrugClass
rangeIncludes: LifestyleModification
rangeIncludes: MedicalTherapy
rangeIncludes: Drug

birthDate
type: Property
comment: Date of birth.
domainIncludes: Person
rangeIncludes: Date

accommodationCategory
type: Property
comment: Category of an Accommodation, following real estate conventions, e.g. RESO (see [PropertySubType](https://ddwiki.reso.org/display/DDW17/PropertySubType+Field), and [PropertyType](https://ddwiki.reso.org/display/DDW17/PropertyType+Field) fields for suggested values).
sub property of: category
domainIncludes: Accommodation
isPartOf: pending.schema.org
rangeIncludes: Text
source: https://github.com/schemaorg/schemaorg/issues/2373

ResearchOrganization
type: Class
comment: A Research Organization (e.g. scientific institute, research company).
subclass of: Organization
isPartOf: pending.schema.org
source: https://github.com/schemaorg/schemaorg/issues/2877

EUEnergyEfficiencyCategoryA3Plus
type: EUEnergyEfficiencyEnumeration
comment: Represents EU Energy Efficiency Class A+++ as defined in EU energy labeling regulations.
isPartOf: pending.schema.org
source: https://github.com/schemaorg/schemaorg/issues/2670

NewCondition
type: OfferItemCondition
comment: Indicates that the item is new.

itemDefectReturnLabelSource
type: Property
comment: The method (from an enumeration) by which the customer obtains a return shipping label for a defect product.
domainIncludes: MerchantReturnPolicy
isPartOf: pending.schema.org
rangeIncludes: ReturnLabelSourceEnumeration
source: https://github.com/schemaorg/schemaorg/issues/2880

currentExchangeRate
type: Property
comment: The current price of a currency.
contributor: FIBO
domainIncludes: ExchangeRateSpecification
isPartOf: pending.schema.org
rangeIncludes: UnitPriceSpecification
source: https://github.com/schemaorg/schemaorg/issues/1253

PrintDigitalSource
type: IPTCDigitalSourceEnumeration
comment: Content coded as 'print' using the IPTC digital source type vocabulary.
isPartOf: pending.schema.org
source: https://github.com/schemaorg/schemaorg/issues/3392

TVClip
type: Class
comment: A short TV program or a segment/part of a TV program.
subclass of: Clip

legalAddress
type: Property
equivalent property: hasRegisteredAddress
comment: The legal address of an organization which acts as the officially registered address used for legal and tax purposes. The legal address can be different from the place of operations of a business and other addresses can be part of an organization.
sub property of: hasAddress
domainIncludes: Organization
rangeIncludes: PostalAddress

inAlbum
type: Property
comment: The album to which this recording belongs.
domainIncludes: MusicRecording
rangeIncludes: MusicAlbum

hasGS1DigitalLink
type: Property
comment: The GS1 digital link associated with the object. This URL should conform to the particular requirements of digital links. The link should only contain the Application Identifiers (AIs) that are relevant for the entity being annotated, for instance a Product or an Organization, and for the correct granularity. In particular, for products: A Digital Link that contains a serial number (AI 21) should only be present on instances of IndividualProduct A Digital Link that contains a lot number (AI 10) should be annotated as SomeProducts if only products from that lot are sold, or IndividualProduct if there is only a specific product. A Digital Link that contains a global model number (AI 8013) should be attached to a Product or a ProductModel. Other item types should be adapted similarly.
sub property of: identifier
domainIncludes: Product
domainIncludes: Offer
domainIncludes: Place
domainIncludes: Organization
isPartOf: pending.schema.org
rangeIncludes: URL
source: https://github.com/schemaorg/schemaorg/issues/3475

MusicComposition
type: Class
comment: A musical composition.
subclass of: CreativeWork
contributor: MBZ

Nonprofit527
type: USNonprofitType
comment: Nonprofit527: Non-profit type referring to political organizations.
isPartOf: pending.schema.org
source: https://github.com/schemaorg/schemaorg/issues/2543

VeterinaryCare
type: Class
comment: A vet's office.
subclass of: MedicalOrganization
isPartOf: health-lifesci.schema.org

BankOrCreditUnion
type: Class
comment: Bank or credit union.
subclass of: FinancialService

blogPosts
type: Property
comment: Indicates a post that is part of a Blog. Note that historically, what we term a "Blog" was once known as a "weblog", and that what we term a "BlogPosting" is now often colloquially referred to as a "blog".
domainIncludes: Blog
rangeIncludes: BlogPosting
supersededBy: blogPost

diversityStaffingReport
type: Property
comment: For an Organization (often but not necessarily a NewsMediaOrganization), a report on staffing diversity issues. In a news context this might be for example ASNE or RTDNA (US) reports, or self-reported.
sub property of: publishingPrinciples
contributor: TP
domainIncludes: NewsMediaOrganization
domainIncludes: Organization
isPartOf: pending.schema.org
rangeIncludes: URL
rangeIncludes: Article
source: https://github.com/schemaorg/schemaorg/issues/1525

embedUrl
type: Property
comment: A URL pointing to a player for a specific video. In general, this is the information in the ```src``` element of an ```embed``` tag and should not be the same as the content of the ```loc``` tag.
domainIncludes: MediaObject
rangeIncludes: URL

encodingType
type: Property
comment: The supported encoding type(s) for an EntryPoint request.
domainIncludes: EntryPoint
rangeIncludes: Text

contentType
type: Property
comment: The supported content type(s) for an EntryPoint response.
domainIncludes: EntryPoint
rangeIncludes: Text

DrawAction
type: Class
comment: The act of producing a visual/graphical representation of an object, typically with a pen/pencil and paper as instruments.
subclass of: CreateAction

Distance
type: Class
comment: Properties that take Distances as values are of the form '<Number> <Length unit of measure>'. E.g., '7 ft'.
subclass of: Quantity

reservationId
type: Property
comment: A unique identifier for the reservation.
domainIncludes: Reservation
rangeIncludes: Text

Role
type: Class
comment: Represents additional information about a relationship or property. For example a Role can be used to say that a 'member' role linking some SportsTeam to a player occurred during a particular time period. Or that a Person's 'actor' role in a Movie was for some particular characterName. Such properties can be attached to a Role entity, which is then associated with the main entities using ordinary properties like 'member' or 'actor'.\n\nSee also [blog post](https://blog.schema.org/2014/06/16/introducing-role/).
subclass of: Intangible

memberOf
type: Property
comment: An Organization (or ProgramMembership) to which this Person or Organization belongs.
domainIncludes: Organization
domainIncludes: Person
inverseOf: member
rangeIncludes: ProgramMembership
rangeIncludes: Organization
rangeIncludes: MemberProgramTier

Muscle
type: Class
comment: A muscle is an anatomical structure consisting of a contractile form of tissue that animals use to effect movement.
subclass of: AnatomicalStructure
isPartOf: health-lifesci.schema.org

interactionService
type: Property
comment: The WebSite or SoftwareApplication where the interactions took place.
domainIncludes: InteractionCounter
rangeIncludes: SoftwareApplication
rangeIncludes: WebSite

numberOfEpisodes
type: Property
comment: The number of episodes in this season or series.
domainIncludes: TVSeries
domainIncludes: CreativeWorkSeason
domainIncludes: VideoGameSeries
domainIncludes: RadioSeries
rangeIncludes: Integer

numberOfAvailableAccommodationUnits
type: Property
comment: Indicates the number of available accommodation units in an ApartmentComplex, or the number of accommodation units for a specific FloorPlan (within its specific ApartmentComplex). See also numberOfAccommodationUnits.
domainIncludes: ApartmentComplex
domainIncludes: FloorPlan
isPartOf: pending.schema.org
rangeIncludes: QuantitativeValue
source: https://github.com/schemaorg/schemaorg/issues/2373

relatedStructure
type: Property
comment: Related anatomical structure(s) that are not part of the system but relate or connect to it, such as vascular bundles associated with an organ system.
domainIncludes: AnatomicalSystem
isPartOf: health-lifesci.schema.org
rangeIncludes: AnatomicalStructure

GameServerStatus
type: Class
comment: Status of a game server.
subclass of: StatusEnumeration

itemReviewed
type: Property
comment: The item that is being reviewed/rated.
domainIncludes: AggregateRating
domainIncludes: Review
rangeIncludes: Thing

priceRange
type: Property
comment: The price range of the business, for example ```$$$```.
domainIncludes: LocalBusiness
rangeIncludes: Text

shippingRate
type: Property
comment: The shipping rate is the cost of shipping to the specified destination. Typically, the maxValue and currency values (of the MonetaryAmount) are most appropriate.
domainIncludes: ShippingRateSettings
domainIncludes: OfferShippingDetails
domainIncludes: ShippingConditions
rangeIncludes: MonetaryAmount
rangeIncludes: ShippingRateSettings
source: https://github.com/schemaorg/schemaorg/issues/2506
source: https://github.com/schemaorg/schemaorg/issues/3617

broadcastSignalModulation
type: Property
comment: The modulation (e.g. FM, AM, etc) used by a particular broadcast service.
domainIncludes: BroadcastFrequencySpecification
isPartOf: pending.schema.org
rangeIncludes: QualitativeValue
rangeIncludes: Text
source: https://github.com/schemaorg/schemaorg/issues/2111

acceptedPaymentMethod
type: Property
comment: The payment method(s) that are accepted in general by an organization, or for some specific demand or offer.
contributor: GoodRelationsTerms
domainIncludes: Offer
domainIncludes: Demand
domainIncludes: Organization
rangeIncludes: PaymentMethod
rangeIncludes: LoanOrCredit
rangeIncludes: Text
source: https://github.com/schemaorg/schemaorg/issues/3537

layoutImage
type: Property
comment: A schematic image showing the floorplan layout.
sub property of: image
domainIncludes: FloorPlan
isPartOf: pending.schema.org
rangeIncludes: URL
rangeIncludes: ImageObject
source: https://github.com/schemaorg/schemaorg/issues/2690

HousePainter
type: Class
comment: A house painting service.
subclass of: HomeAndConstructionBusiness

Neurologic
type: MedicalSpecialty
comment: A specific branch of medical science that studies the nerves and nervous system and its respective disease states.
isPartOf: health-lifesci.schema.org

creativeWorkStatus
type: Property
comment: The status of a creative work in terms of its stage in a lifecycle. Example terms include Incomplete, Draft, Published, Obsolete. Some organizations define a set of terms for the stages of their publication lifecycle.
domainIncludes: CreativeWork
isPartOf: pending.schema.org
rangeIncludes: DefinedTerm
rangeIncludes: Text
source: https://github.com/schemaorg/schemaorg/issues/987

WearableSizeGroupHusky
type: WearableSizeGroupEnumeration
comment: Size group "Husky" (or "Stocky") for wearables.
isPartOf: pending.schema.org
source: https://github.com/schemaorg/schemaorg/issues/2811

alternateName
type: Property
comment: An alias for the item.
domainIncludes: Thing
rangeIncludes: Text

LowLactoseDiet
type: RestrictedDiet
comment: A diet appropriate for people with lactose intolerance.

Bridge
type: Class
comment: A bridge.
subclass of: CivicStructure

runsTo
type: Property
comment: The vasculature the lymphatic structure runs, or efferents, to.
domainIncludes: LymphaticVessel
isPartOf: health-lifesci.schema.org
rangeIncludes: Vessel

observationDate
type: Property
comment: The observationDate of an Observation.
domainIncludes: Observation
isPartOf: pending.schema.org
rangeIncludes: Date
rangeIncludes: DateTime
source: https://github.com/schemaorg/schemaorg/issues/2291

geoEquals
type: Property
comment: Represents spatial relations in which two geometries (or the places they represent) are topologically equal, as defined in [DE-9IM](https://en.wikipedia.org/wiki/DE-9IM). "Two geometries are topologically equal if their interiors intersect and no part of the interior or boundary of one geometry intersects the exterior of the other" (a symmetric relationship).
domainIncludes: Place
domainIncludes: GeospatialGeometry
rangeIncludes: Place
rangeIncludes: GeospatialGeometry

3DModel
type: Class
comment: A 3D model represents some kind of 3D content, which may have encodings in one or more MediaObjects. Many 3D formats are available (e.g. see [Wikipedia](https://en.wikipedia.org/wiki/Category:3D_graphics_file_formats)); specific encoding formats can be represented using the encodingFormat property applied to the relevant MediaObject. For the case of a single file published after Zip compression, the convention of appending '+zip' to the encodingFormat can be used. Geospatial, AR/VR, artistic/animation, gaming, engineering and scientific content can all be represented using 3DModel.
subclass of: MediaObject
isPartOf: pending.schema.org
source: https://github.com/schemaorg/schemaorg/issues/2140

InvestmentFund
type: Class
comment: A company or fund that gathers capital from a number of investors to create a pool of money that is then re-invested into stocks, bonds and other assets.
subclass of: InvestmentOrDeposit
contributor: FIBO
isPartOf: pending.schema.org
source: https://github.com/schemaorg/schemaorg/issues/1253

maximumPhysicalAttendeeCapacity
type: Property
comment: The maximum physical attendee capacity of an Event whose eventAttendanceMode is OfflineEventAttendanceMode (or the offline aspects, in the case of a MixedEventAttendanceMode).
domainIncludes: Event
isPartOf: pending.schema.org
rangeIncludes: Integer
source: https://github.com/schemaorg/schemaorg/issues/1842

TreatmentsHealthAspect
type: HealthAspectEnumeration
comment: Treatments or related therapies for a Topic.
isPartOf: pending.schema.org
source: https://github.com/schemaorg/schemaorg/issues/2374

supportingData
type: Property
comment: Supporting data for a SoftwareApplication.
domainIncludes: SoftwareApplication
rangeIncludes: DataFeed

LeftHandDriving
type: SteeringPositionValue
comment: The steering position is on the left side of the vehicle (viewed from the main direction of driving).
contributor: Automotive Ontology Working Group

Restaurant
type: Class
comment: A restaurant.
subclass of: FoodEstablishment

includedInDataCatalog
type: Property
comment: A data catalog which contains this dataset.
domainIncludes: Dataset
inverseOf: dataset
rangeIncludes: DataCatalog

quest
type: Property
comment: The task that a player-controlled character, or group of characters may complete in order to gain a reward.
domainIncludes: Game
domainIncludes: VideoGameSeries
rangeIncludes: Thing

Float
type: Class
comment: Data type: Floating number.
subclass of: Number

TouristInformationCenter
type: Class
comment: A tourist information center.
subclass of: LocalBusiness

RightHandDriving
type: SteeringPositionValue
comment: The steering position is on the right side of the vehicle (viewed from the main direction of driving).
contributor: Automotive Ontology Working Group

endDate
type: Property
equivalent property: hasEndDate
comment: The end date and time of the item (in [ISO 8601 date format](http://en.wikipedia.org/wiki/ISO_8601)).
domainIncludes: EducationalOccupationalProgram
domainIncludes: MerchantReturnPolicySeasonalOverride
domainIncludes: Schedule
domainIncludes: CreativeWorkSeason
domainIncludes: Role
domainIncludes: Event
domainIncludes: CreativeWorkSeries
domainIncludes: DatedMoneySpecification
rangeIncludes: DateTime
rangeIncludes: Date
source: https://github.com/schemaorg/schemaorg/issues/2486

Hardcover
type: BookFormatType
comment: A durable, archival-quality book featuring a rigid protective shell made of heavy board wrapped in cloth or paper, designed to withstand heavy use and preservation on a shelf.

PublicationIssue
type: Class
equivalent class: Issue
comment: A part of a successively published publication such as a periodical or publication volume, often numbered, usually containing a grouping of works such as articles.\n\nSee also [blog post](https://blog-schema.org/2014/09/02/schema-org-support-for-bibliographic-relationships-and-periodicals/).
subclass of: CreativeWork
contributor: bibex

SRP
type: PriceTypeEnumeration
comment: Represents the suggested retail price ("SRP") of an offered product.
isPartOf: pending.schema.org
source: https://github.com/schemaorg/schemaorg/issues/2712

gtin14
type: Property
comment: The GTIN-14 code of the product, or the product to which the offer refers. See [GS1 GTIN Summary](http://www.gs1.org/barcodes/technical/idkeys/gtin) for more details.
sub property of: gtin
sub property of: identifier
contributor: GoodRelationsTerms
domainIncludes: Product
domainIncludes: Offer
domainIncludes: Demand
rangeIncludes: Text

PublicationVolume
type: Class
comment: A part of a successively published publication such as a periodical or multi-volume work, often numbered. It may represent a time span, such as a year.\n\nSee also [blog post](https://blog-schema.org/2014/09/02/schema-org-support-for-bibliographic-relationships-and-periodicals/).
subclass of: CreativeWork
contributor: bibex

accountablePerson
type: Property
comment: Specifies the Person that is legally accountable for the CreativeWork.
domainIncludes: CreativeWork
rangeIncludes: Person

actionableFeedbackPolicy
type: Property
comment: For a NewsMediaOrganization or other news-related Organization, a statement about public engagement activities (for news media, the newsroom’s), including involving the public - digitally or otherwise -- in coverage decisions, reporting and activities after publication.
sub property of: publishingPrinciples
contributor: TP
domainIncludes: NewsMediaOrganization
domainIncludes: Organization
isPartOf: pending.schema.org
rangeIncludes: CreativeWork
rangeIncludes: URL
source: https://github.com/schemaorg/schemaorg/issues/1525

seasons
type: Property
comment: A season in a media series.
domainIncludes: RadioSeries
domainIncludes: TVSeries
domainIncludes: VideoGameSeries
rangeIncludes: CreativeWorkSeason
supersededBy: season

availableThrough
type: Property
comment: After this date, the item will no longer be available for pickup.
domainIncludes: DeliveryEvent
rangeIncludes: DateTime

LowFatDiet
type: RestrictedDiet
comment: A diet focused on reduced fat and cholesterol intake.

releasedEvent
type: Property
comment: The place and time the release was issued, expressed as a PublicationEvent.
domainIncludes: CreativeWork
rangeIncludes: PublicationEvent

mobileUrl
type: Property
comment: The mobileUrl property is provided for specific situations in which data consumers need to determine whether one of several provided URLs is a dedicated 'mobile site'. To discourage over-use, and reflecting intial usecases, the property is expected only on Product and Offer, rather than Thing. The general trend in web technology is towards [responsive design](https://en.wikipedia.org/wiki/Responsive_web_design) in which content can be flexibly adapted to a wide range of browsing environments. Pages and sites referenced with the long-established url property should ideally also be usable on a wide variety of devices, including mobile phones. In most cases, it would be pointless and counter productive to attempt to update all url markup to use mobileUrl for more mobile-oriented pages. The property is intended for the case when items (primarily Product and Offer) have extra URLs hosted on an additional "mobile site" alongside the main one. It should not be taken as an endorsement of this publication style.
domainIncludes: Offer
domainIncludes: Product
isPartOf: pending.schema.org
rangeIncludes: Text
source: https://github.com/schemaorg/schemaorg/issues/3134

relatedAnatomy
type: Property
comment: Anatomical systems or structures that relate to the superficial anatomy.
domainIncludes: SuperficialAnatomy
isPartOf: health-lifesci.schema.org
rangeIncludes: AnatomicalSystem
rangeIncludes: AnatomicalStructure

itemOffered
type: Property
comment: An item being offered (or demanded). The transactional nature of the offer or demand is documented using businessFunction, e.g. sell, lease etc. While several common expected types are listed explicitly in this definition, others can be used. Using a second type, such as Product or a subtype of Product, can clarify the nature of the offer.
domainIncludes: Offer
domainIncludes: Demand
inverseOf: offers
rangeIncludes: MenuItem
rangeIncludes: Trip
rangeIncludes: Event
rangeIncludes: CreativeWork
rangeIncludes: Product
rangeIncludes: Service
rangeIncludes: AggregateOffer

DataDownload
type: Class
equivalent class: Distribution
comment: All or part of a Dataset in downloadable form.
subclass of: MediaObject
contributor: DatasetClass

SatiricalArticle
type: Class
comment: An Article whose content is primarily satirical(https://en.wikipedia.org/wiki/Satire) in nature, i.e. unlikely to be literally true. A satirical article is sometimes but not necessarily also a NewsArticle. ScholarlyArticles are also sometimes satirized.
subclass of: Article
contributor: TP
isPartOf: pending.schema.org
source: https://github.com/schemaorg/schemaorg/issues/1525

LinkRole
type: Class
comment: A Role that represents a Web link, e.g. as expressed via the 'url' property. Its linkRelationship property can indicate URL-based and plain textual link types, e.g. those in IANA link registry or others such as 'amphtml'. This structure provides a placeholder where details from HTML's link element can be represented outside of HTML, e.g. in JSON-LD feeds.
subclass of: Role
isPartOf: pending.schema.org
source: https://github.com/schemaorg/schemaorg/issues/1045

ListItem
type: Class
comment: An list item, e.g. a step in a checklist or how-to description.
subclass of: Intangible

step
type: Property
comment: A single step item (as HowToStep, text, document, video, etc.) or a HowToSection.
domainIncludes: HowTo
rangeIncludes: Text
rangeIncludes: CreativeWork
rangeIncludes: HowToStep
rangeIncludes: HowToSection

elevation
type: Property
comment: The elevation of a location ([WGS 84](https://en.wikipedia.org/wiki/World_Geodetic_System)). Values may be of the form 'NUMBER UNIT\_OF\_MEASUREMENT' (e.g., '1,000 m', '3,200 ft') while numbers alone should be assumed to be a value in meters.
domainIncludes: GeoCoordinates
domainIncludes: GeoShape
rangeIncludes: Text
rangeIncludes: Number

City
type: Class
equivalent class: Municipality
comment: A city or town.
subclass of: AdministrativeArea

AboutPage
type: Class
comment: Web page type: About page.
subclass of: WebPage

MedicalEntity
type: Class
comment: The most generic type of entity related to health and the practice of medicine.
subclass of: Thing
isPartOf: health-lifesci.schema.org

vendor
type: Property
comment: 'vendor' is an earlier term for 'seller'.
sub property of: participant
domainIncludes: BuyAction
rangeIncludes: Organization
rangeIncludes: Person
supersededBy: seller

SizeSystemMetric
type: SizeSystemEnumeration
comment: Metric size system.
isPartOf: pending.schema.org
source: https://github.com/schemaorg/schemaorg/issues/2811

BusStation
type: Class
comment: A bus station.
subclass of: CivicStructure

priceValidUntil
type: Property
equivalent property: EffectiveEndDateTime
comment: The date after which the price is no longer available.
sub property of: endDate
domainIncludes: Offer
rangeIncludes: Date

scheduledTime
type: Property
comment: The time the object is scheduled to.
domainIncludes: PlanAction
rangeIncludes: Date
rangeIncludes: DateTime

supplyTo
type: Property
comment: The area to which the artery supplies blood.
domainIncludes: Artery
isPartOf: health-lifesci.schema.org
rangeIncludes: AnatomicalStructure

incomeLimit
type: Property
comment: Optional. Income limit for which the incentive is applicable for. If MonetaryAmount is specified, this should be based on annualized income (e.g. if an incentive is limited to those making <$114,000 annually): { "@type": "MonetaryAmount", "maxValue": 114000, "currency": "USD", } Use Text for incentives that are limited based on other criteria, for example if an incentive is only available to recipients making 120% of the median poverty income in their area.
domainIncludes: FinancialIncentive
isPartOf: pending.schema.org
rangeIncludes: MonetaryAmount
rangeIncludes: Text
source: https://github.com/schemaorg/schemaorg/issues/3572

PurchaseType
type: Class
comment: Enumerates a purchase type for an item.
subclass of: Enumeration
isPartOf: pending.schema.org
source: https://github.com/schemaorg/schemaorg/issues/3572

CommunityHealth
type: MedicalSpecialty
comment: A field of public health focusing on improving health characteristics of a defined population in relation with their geographical or environment areas.
subclass of: MedicalBusiness
isPartOf: health-lifesci.schema.org

operatingSystem
type: Property
comment: Operating systems supported (Windows 7, OS X 10.6, Android 1.6).
domainIncludes: SoftwareApplication
rangeIncludes: OperatingSystem
rangeIncludes: Text

PerformingGroup
type: Class
comment: A performance group, such as a band, an orchestra, or a circus.
subclass of: Organization

stageAsNumber
type: Property
comment: The stage represented as a number, e.g. 3.
domainIncludes: MedicalConditionStage
isPartOf: health-lifesci.schema.org
rangeIncludes: Number

about
type: Property
equivalent property: subject
comment: The subject matter of an object.
domainIncludes: DefinedTerm
domainIncludes: Event
domainIncludes: Certification
domainIncludes: CreativeWork
domainIncludes: DefinedTermSet
domainIncludes: CommunicateAction
inverseOf: subjectOf
rangeIncludes: Thing
source: https://github.com/schemaorg/schemaorg/issues/4588
source: https://github.com/schemaorg/schemaorg/issues/1670

Pamphlet
type: BookFormatType
comment: A small, unbound or stapled booklet consisting of few pages with a flexible paper cover, designed for the economical distribution of focused information on a single subject.

downloadUrl
type: Property
comment: If the file can be downloaded, URL to download the binary.
domainIncludes: SoftwareApplication
rangeIncludes: URL

Motel
type: Class
comment: A motel. See also the dedicated document on the use of schema.org for marking up hotels and other forms of accommodations.
subclass of: LodgingBusiness

editEIDR
type: Property
comment: An [EIDR](https://eidr.org/) (Entertainment Identifier Registry) identifier representing a specific edit / edition for a work of film or television. For example, the motion picture known as "Ghostbusters" whose titleEIDR is "10.5240/7EC7-228A-510A-053E-CBB8-J" has several edits, e.g. "10.5240/1F2A-E1C5-680A-14C6-E76B-I" and "10.5240/8A35-3BEE-6497-5D12-9E4F-3". Since schema.org types like Movie and TVEpisode can be used for both works and their multiple expressions, it is possible to use titleEIDR alone (for a general description), or alongside editEIDR for a more edit-specific description.
sub property of: identifier
domainIncludes: CreativeWork
isPartOf: pending.schema.org
rangeIncludes: Text
rangeIncludes: URL
source: https://github.com/schemaorg/schemaorg/issues/2469

validFrom
type: Property
equivalent property: hasStartDate
comment: The date when the item becomes valid.
contributor: GoodRelationsTerms
domainIncludes: Certification
domainIncludes: MonetaryAmount
domainIncludes: OpeningHoursSpecification
domainIncludes: FinancialIncentive
domainIncludes: LocationFeatureSpecification
domainIncludes: Offer
domainIncludes: PriceSpecification
domainIncludes: Demand
domainIncludes: Permit
rangeIncludes: DateTime
rangeIncludes: Date

DiscoverAction
type: Class
comment: The act of discovering/finding an object.
subclass of: FindAction

founders
type: Property
comment: A person who founded this organization.
domainIncludes: Organization
rangeIncludes: Person
supersededBy: founder

Bacteria
type: InfectiousAgentClass
comment: Pathogenic bacteria that cause bacterial infection.
isPartOf: health-lifesci.schema.org

foodEstablishment
type: Property
comment: A sub property of location. The specific food establishment where the action occurred.
sub property of: location
domainIncludes: CookAction
rangeIncludes: FoodEstablishment
rangeIncludes: Place

PharmacySpecialty
type: MedicalSpecialty
comment: The practice or art and science of preparing and dispensing drugs and medicines.
isPartOf: health-lifesci.schema.org

maxValue
type: Property
comment: The upper value of some characteristic or property.
sub property of: hasUpperBound
contributor: GoodRelationsTerms
domainIncludes: QuantitativeValue
domainIncludes: MonetaryAmount
domainIncludes: PropertyValue
domainIncludes: PropertyValueSpecification
rangeIncludes: Number

TypesHealthAspect
type: HealthAspectEnumeration
comment: Categorization and other types related to a topic.
isPartOf: pending.schema.org
source: https://github.com/schemaorg/schemaorg/issues/2374

contentReferenceTime
type: Property
comment: The specific time described by a creative work, for works (e.g. articles, video objects etc.) that emphasise a particular moment within an Event.
domainIncludes: CreativeWork
isPartOf: pending.schema.org
rangeIncludes: DateTime
source: https://github.com/schemaorg/schemaorg/issues/1050

HardwareStore
type: Class
comment: A hardware store.
subclass of: Store

DiabeticDiet
type: RestrictedDiet
comment: A diet appropriate for people with diabetes.

IncentiveQualifiedExpenseTypeServicesOnly
type: IncentiveQualifiedExpenseType
comment: This incentive applies to services only.
isPartOf: pending.schema.org
source: https://github.com/schemaorg/schemaorg/issues/3572

appearance
type: Property
comment: Indicates an occurrence of a Claim in some CreativeWork.
sub property of: workExample
domainIncludes: Claim
isPartOf: pending.schema.org
rangeIncludes: CreativeWork
source: https://github.com/schemaorg/schemaorg/issues/1828

rxcui
type: Property
comment: The RxCUI drug identifier from RXNORM.
domainIncludes: Drug
isPartOf: pending.schema.org
rangeIncludes: Text
source: https://github.com/schemaorg/schemaorg/issues/1062

Nonprofit501c24
type: USNonprofitType
comment: Nonprofit501c24: Non-profit type referring to Section 4049 ERISA Trusts.
isPartOf: pending.schema.org
source: https://github.com/schemaorg/schemaorg/issues/2543

MedicalCode
type: Class
comment: A code for a medical entity.
subclass of: MedicalIntangible
subclass of: CategoryCode
isPartOf: health-lifesci.schema.org

aggregateRating
type: Property
comment: The overall rating, based on a collection of reviews or ratings, of the item.
domainIncludes: CreativeWork
domainIncludes: Product
domainIncludes: Brand
domainIncludes: Offer
domainIncludes: Organization
domainIncludes: Event
domainIncludes: Place
domainIncludes: Service
rangeIncludes: AggregateRating

Researcher
type: Class
comment: Researchers.
subclass of: Audience

legislationType
type: Property
equivalent property: type document
comment: The type of the legislation. Examples of values are "law", "act", "directive", "decree", "regulation", "statutory instrument", "loi organique", "règlement grand-ducal", etc., depending on the country.
sub property of: genre
contributor: ELI
domainIncludes: Legislation
isPartOf: pending.schema.org
rangeIncludes: CategoryCode
rangeIncludes: Text
source: https://github.com/schemaorg/schemaorg/issues/1156
source: eli

masthead
type: Property
comment: For a NewsMediaOrganization, a link to the masthead page or a page listing top editorial management.
sub property of: publishingPrinciples
contributor: TP
domainIncludes: NewsMediaOrganization
isPartOf: pending.schema.org
rangeIncludes: CreativeWork
rangeIncludes: URL
source: https://github.com/schemaorg/schemaorg/issues/1525

PropertyValueSpecification
type: Class
comment: A Property value specification.
subclass of: Intangible
contributor: ActionCollabClass

EUEnergyEfficiencyCategoryF
type: EUEnergyEfficiencyEnumeration
comment: Represents EU Energy Efficiency Class F as defined in EU energy labeling regulations.
isPartOf: pending.schema.org
source: https://github.com/schemaorg/schemaorg/issues/2670

Poster
type: Class
comment: A large, usually printed placard, bill, or announcement, often illustrated, that is posted to advertise or publicize something.
subclass of: CreativeWork
isPartOf: pending.schema.org
source: https://github.com/schemaorg/schemaorg/issues/1448

returnMethod
type: Property
comment: The type of return method offered, specified from an enumeration.
domainIncludes: MerchantReturnPolicy
domainIncludes: MerchantReturnPolicySeasonalOverride
isPartOf: pending.schema.org
rangeIncludes: ReturnMethodEnumeration
source: https://github.com/schemaorg/schemaorg/issues/2880

AchieveAction
type: Class
comment: The act of accomplishing something via previous efforts. It is an instantaneous action rather than an ongoing process.
subclass of: Action

OnlineFull
type: GameServerStatus
comment: Game server status: OnlineFull. Server is online but unavailable. The maximum number of players has reached.

byDay
type: Property
comment: Defines the day(s) of the week on which a recurring Event takes place. May be specified using either DayOfWeek, or alternatively Text conforming to iCal's syntax for byDay recurrence rules.
domainIncludes: Schedule
isPartOf: pending.schema.org
rangeIncludes: Text
rangeIncludes: DayOfWeek
source: https://github.com/schemaorg/schemaorg/issues/1457

extendedAddress
type: Property
comment: An address extension such as an apartment number, C/O or alternative name.
domainIncludes: PostalAddress
rangeIncludes: Text

riskFactor
type: Property
comment: A modifiable or non-modifiable factor that increases the risk of a patient contracting this condition, e.g. age, coexisting condition.
domainIncludes: MedicalCondition
isPartOf: health-lifesci.schema.org
rangeIncludes: MedicalRiskFactor

SymptomsHealthAspect
type: HealthAspectEnumeration
comment: Symptoms or related symptoms of a Topic.
isPartOf: pending.schema.org
source: https://github.com/schemaorg/schemaorg/issues/2374

alumniOf
type: Property
comment: An organization that the person is an alumni of.
domainIncludes: Person
inverseOf: alumni
rangeIncludes: Organization
rangeIncludes: EducationalOrganization

videoFormat
type: Property
comment: The type of screening or video broadcast used (e.g. IMAX, 3D, SD, HD, etc.).
domainIncludes: BroadcastService
domainIncludes: ScreeningEvent
domainIncludes: BroadcastEvent
rangeIncludes: Text

photos
type: Property
comment: Photographs of this place.
domainIncludes: Place
rangeIncludes: Photograph
rangeIncludes: ImageObject
supersededBy: photo

nutrition
type: Property
comment: Nutrition information about the recipe or menu item.
domainIncludes: Recipe
domainIncludes: MenuItem
rangeIncludes: NutritionInformation

BroadcastRelease
type: MusicAlbumReleaseType
comment: BroadcastRelease.
contributor: MBZ

negativeNotes
type: Property
comment: Provides negative considerations regarding something, most typically in pro/con lists for reviews (alongside positiveNotes). For symmetry In the case of a Review, the property describes the itemReviewed from the perspective of the review; in the case of a Product, the product itself is being described. Since product descriptions tend to emphasise positive claims, it may be relatively unusual to find negativeNotes used in this way. Nevertheless for the sake of symmetry, negativeNotes can be used on Product. The property values can be expressed either as unstructured text (repeated as necessary), or if ordered, as a list (in which case the most negative is at the beginning of the list).
domainIncludes: Review
domainIncludes: Product
isPartOf: pending.schema.org
rangeIncludes: ItemList
rangeIncludes: ListItem
rangeIncludes: Text
rangeIncludes: WebContent
source: https://github.com/schemaorg/schemaorg/issues/2832

relatedTherapy
type: Property
comment: A medical therapy related to this anatomy.
domainIncludes: SuperficialAnatomy
domainIncludes: AnatomicalStructure
domainIncludes: AnatomicalSystem
isPartOf: health-lifesci.schema.org
rangeIncludes: MedicalTherapy

MedicalWebPage
type: Class
comment: A web page that provides medical information.
subclass of: WebPage
isPartOf: health-lifesci.schema.org

RearWheelDriveConfiguration
type: DriveWheelConfigurationValue
comment: Real-wheel drive is a transmission layout where the engine drives the rear wheels.
contributor: Automotive Ontology Working Group

AutoDealer
type: Class
comment: An car dealership.
subclass of: AutomotiveBusiness

containedInPlace
type: Property
comment: The basic containment relation between a place and one that contains it.
domainIncludes: Place
inverseOf: containsPlace
rangeIncludes: Place

Episode
type: Class
comment: A media episode (e.g. TV, radio, video game) which can be part of a series or season.
subclass of: CreativeWork

Attorney
type: Class
comment: Professional service: Attorney. \n\nThis type is deprecated - LegalService is more inclusive and less ambiguous.
subclass of: LegalService

HowToSupply
type: Class
comment: A supply consumed when performing the instructions for how to achieve a result.
subclass of: HowToItem

drug
type: Property
comment: Specifying a drug or medicine used in a medication procedure.
domainIncludes: DrugClass
domainIncludes: TherapeuticProcedure
domainIncludes: MedicalCondition
domainIncludes: Patient
isPartOf: health-lifesci.schema.org
rangeIncludes: Drug

HealthTopicContent
type: Class
comment: HealthTopicContent is WebContent that is about some aspect of a health topic, e.g. a condition, its symptoms or treatments. Such content may be comprised of several parts or sections and use different types of media. Multiple instances of WebContent (and hence HealthTopicContent) can be related using hasPart / isPartOf where there is some kind of content hierarchy, and their content described with about and mentions e.g. building upon the existing MedicalCondition vocabulary.
subclass of: WebContent
isPartOf: pending.schema.org
source: https://github.com/schemaorg/schemaorg/issues/2374

WearableSizeSystemEurope
type: WearableSizeSystemEnumeration
comment: European size system for wearables.
isPartOf: pending.schema.org
source: https://github.com/schemaorg/schemaorg/issues/2811

geoOverlaps
type: Property
comment: Represents a relationship between two geometries (or the places they represent), relating a geometry to another that geospatially overlaps it, i.e. they have some but not all points in common. As defined in [DE-9IM](https://en.wikipedia.org/wiki/DE-9IM).
domainIncludes: GeospatialGeometry
domainIncludes: Place
rangeIncludes: GeospatialGeometry
rangeIncludes: Place

cvdFacilityId
type: Property
comment: Identifier of the NHSN facility that this data record applies to. Use cvdFacilityCounty to indicate the county. To provide other details, healthcareReportingData can be used on a Hospital entry.
domainIncludes: CDCPMDRecord
isPartOf: pending.schema.org
rangeIncludes: Text
source: https://github.com/schemaorg/schemaorg/issues/2521

mapType
type: Property
comment: Indicates the kind of Map, from the MapCategoryType Enumeration.
domainIncludes: Map
rangeIncludes: MapCategoryType

recordedIn
type: Property
comment: The CreativeWork that captured all or part of this Event.
domainIncludes: Event
inverseOf: recordedAt
rangeIncludes: CreativeWork

partOfTrip
type: Property
comment: Identifies that this Trip is a subTrip of another Trip. For example Day 1, Day 2, etc. of a multi-day trip.
contributor: Tourism
domainIncludes: Trip
inverseOf: subTrip
isPartOf: pending.schema.org
rangeIncludes: Trip
source: https://github.com/schemaorg/schemaorg/issues/1810

EnergyConsumptionDetails
type: Class
comment: EnergyConsumptionDetails represents information related to the energy efficiency of a product that consumes energy. The information that can be provided is based on international regulations such as for example [EU directive 2017/1369](https://eur-lex.europa.eu/eli/reg/2017/1369/oj) for energy labeling and the [Energy labeling rule](https://www.ftc.gov/enforcement/rules/rulemaking-regulatory-reform-proceedings/energy-water-use-labeling-consumer) under the Energy Policy and Conservation Act (EPCA) in the US.
subclass of: Intangible
isPartOf: pending.schema.org
source: https://github.com/schemaorg/schemaorg/issues/2670

isLiveBroadcast
type: Property
comment: True if the broadcast is of a live event.
domainIncludes: BroadcastEvent
rangeIncludes: Boolean

Cemetery
type: Class
comment: A graveyard.
subclass of: CivicStructure

NotInForce
type: LegalForceStatus
comment: Indicates that a legislation is currently not in force.
contributor: ELI
isPartOf: pending.schema.org
source: eli
source: https://github.com/schemaorg/schemaorg/issues/1156

TierBenefitLoyaltyReturns
type: TierBenefitEnumeration
comment: Benefit of the tier is members-only returns, for example free unlimited returns.
isPartOf: pending.schema.org
source: https://github.com/schemaorg/schemaorg/issues/3563

MovieTheater
type: Class
comment: A movie theater.
subclass of: EntertainmentBusiness
subclass of: CivicStructure

superEvent
type: Property
comment: An event that this event is a part of. For example, a collection of individual music performances might each have a music festival as their superEvent.
domainIncludes: Event
inverseOf: subEvent
rangeIncludes: Event

alternativeOf
type: Property
comment: Another gene which is a variation of this one.
domainIncludes: Gene
isPartOf: pending.schema.org
rangeIncludes: Gene
source: Gene

SportsEvent
type: Class
comment: Event type: Sports event.
subclass of: Event

healthPlanMarketingUrl
type: Property
comment: The URL that goes directly to the plan brochure for the specific standard plan or plan variation.
domainIncludes: HealthInsurancePlan
isPartOf: pending.schema.org
rangeIncludes: URL
source: https://github.com/schemaorg/schemaorg/issues/1062

exampleOfWork
type: Property
comment: A creative work that this work is an example/instance/realization/derivation of.
contributor: bibex
domainIncludes: CreativeWork
inverseOf: workExample
rangeIncludes: CreativeWork

HealthAspectEnumeration
type: Class
comment: HealthAspectEnumeration enumerates several aspects of health content online, each of which might be described using hasHealthAspect and HealthTopicContent.
subclass of: Enumeration
isPartOf: pending.schema.org
source: https://github.com/schemaorg/schemaorg/issues/2374

MolecularEntity
type: Class
comment: Any constitutionally or isotopically distinct atom, molecule, ion, ion pair, radical, radical ion, complex, conformer etc., identifiable as a separately distinguishable entity.
subclass of: BioChemEntity
isPartOf: pending.schema.org
source: bioschemas.org

follows
type: Property
comment: The most generic uni-directional social relation.
domainIncludes: Person
rangeIncludes: Person

percentile25
type: Property
comment: The 25th percentile value.
domainIncludes: QuantitativeValueDistribution
rangeIncludes: Number
source: https://github.com/schemaorg/schemaorg/issues/1698

Waterfall
type: Class
comment: A waterfall, like Niagara.
subclass of: BodyOfWater

LiteraryEvent
type: Class
comment: Event type: Literary event.
subclass of: Event

yield
type: Property
comment: The quantity that results by performing instructions. For example, a paper airplane, 10 personalized candles.
domainIncludes: HowTo
rangeIncludes: Text
rangeIncludes: QuantitativeValue

PriceTypeEnumeration
type: Class
comment: Enumerates different price types, for example list price, invoice price, and sale price.
subclass of: Enumeration
isPartOf: pending.schema.org
source: https://github.com/schemaorg/schemaorg/issues/2712

CheckOutAction
type: Class
comment: The act of an agent communicating (service provider, social media, etc) their departure of a previously reserved service (e.g. flight check-in) or place (e.g. hotel).\n\nRelated actions:\n\n* CheckInAction: The antonym of CheckOutAction.\n* DepartAction: Unlike DepartAction, CheckOutAction implies that the agent is informing/confirming the end of a previously reserved service.\n* CancelAction: Unlike CancelAction, CheckOutAction implies that the agent is informing/confirming the end of a previously reserved service.
subclass of: CommunicateAction

comprisedOf
type: Property
comment: Specifying something physically contained by something else. Typically used here for the underlying anatomical structures, such as organs, that comprise the anatomical system.
domainIncludes: AnatomicalSystem
isPartOf: health-lifesci.schema.org
rangeIncludes: AnatomicalStructure
rangeIncludes: AnatomicalSystem

financialAidEligible
type: Property
comment: A financial aid type or program which students may use to pay for tuition or fees associated with the program.
domainIncludes: Course
domainIncludes: EducationalOccupationalProgram
isPartOf: pending.schema.org
rangeIncludes: DefinedTerm
rangeIncludes: Text
source: https://github.com/schemaorg/schemaorg/issues/2418

PayAction
type: Class
comment: An agent pays a price to a participant.
subclass of: TradeAction

pageStart
type: Property
equivalent property: pageStart
comment: The page on which the work starts; for example "135" or "xiii".
contributor: bibex
domainIncludes: Article
domainIncludes: PublicationIssue
domainIncludes: Chapter
domainIncludes: PublicationVolume
rangeIncludes: Integer
rangeIncludes: Text

Embassy
type: Class
comment: An embassy.
subclass of: GovernmentBuilding

algorithm
type: Property
comment: The algorithm or rules to follow to compute the score.
domainIncludes: MedicalRiskScore
isPartOf: health-lifesci.schema.org
rangeIncludes: Text

orderQuantity
type: Property
equivalent property: orderQuantity
comment: The number of the item ordered. If the property is not set, assume the quantity is one.
sub property of: hasQuantity
domainIncludes: OrderItem
rangeIncludes: QuantitativeValue
rangeIncludes: Number

breastfeedingWarning
type: Property
comment: Any precaution, guidance, contraindication, etc. related to this drug's use by breastfeeding mothers.
domainIncludes: Drug
isPartOf: health-lifesci.schema.org
rangeIncludes: Text

collection
type: Property
comment: A sub property of object. The collection target of the action.
sub property of: object
domainIncludes: UpdateAction
rangeIncludes: Thing
supersededBy: targetCollection

Message
type: Class
comment: A single message from a sender to one or more organizations or people.
subclass of: CreativeWork

illustrator
type: Property
comment: The illustrator of the book.
domainIncludes: Book
rangeIncludes: Person

studyDesign
type: Property
comment: Specifics about the observational study design (enumerated).
domainIncludes: MedicalObservationalStudy
isPartOf: health-lifesci.schema.org
rangeIncludes: MedicalObservationalStudyDesign

QualitativeValue
type: Class
comment: A predefined value for a product characteristic, e.g. the power cord plug type 'US' or the garment sizes 'S', 'M', 'L', and 'XL'.
subclass of: Enumeration
contributor: good-relations-and-schema-org

postalCodeEnd
type: Property
comment: Last postal code in the range (included). Needs to be after postalCodeBegin.
sub property of: hasUpperBound
domainIncludes: PostalCodeRangeSpecification
rangeIncludes: Text
source: https://github.com/schemaorg/schemaorg/issues/2506

pronouns
type: Property
comment: A short string listing or describing pronouns for a person. Typically the person concerned is the best authority as pronouns are a critical part of personal identity and expression. Publishers and consumers of this information are reminded to treat this data responsibly, take country-specific laws related to gender expression into account, and be wary of out-of-date data and drawing unwarranted inferences about the person being described. In English, formulations such as "they/them", "she/her", and "he/him" are commonly used online and can also be used here. We do not intend to enumerate all possible micro-syntaxes in all languages. More structured and well-defined external values for pronouns can be referenced using the StructuredValue or DefinedTerm values.
domainIncludes: Person
isPartOf: pending.schema.org
rangeIncludes: DefinedTerm
rangeIncludes: StructuredValue
rangeIncludes: Text
source: https://github.com/schemaorg/schemaorg/issues/2935

Nonprofit501c6
type: USNonprofitType
comment: Nonprofit501c6: Non-profit type referring to Business Leagues, Chambers of Commerce, Real Estate Boards.
isPartOf: pending.schema.org
source: https://github.com/schemaorg/schemaorg/issues/2543

originAddress
type: Property
comment: Shipper's address.
domainIncludes: ParcelDelivery
rangeIncludes: PostalAddress

slogan
type: Property
equivalent property: PromotionalMessage
comment: A slogan or motto associated with the item.
domainIncludes: Organization
domainIncludes: Product
domainIncludes: Service
domainIncludes: Brand
domainIncludes: Place
rangeIncludes: Text

OfficialLegalValue
type: LegalValueLevel
comment: All the documents published by an official publisher should have at least the legal value level "OfficialLegalValue". This indicates that the document was published by an organisation with the public task of making it available (e.g. a consolidated version of a EU directive published by the EU Office of Publications).
contributor: ELI
isPartOf: pending.schema.org
source: https://github.com/schemaorg/schemaorg/issues/1156
source: eli

parentService
type: Property
comment: A broadcast service to which the broadcast service may belong to such as regional variations of a national channel.
domainIncludes: BroadcastService
rangeIncludes: BroadcastService

ResultsAvailable
type: MedicalStudyStatus
comment: Results are available.
isPartOf: health-lifesci.schema.org

Collection
type: Class
comment: A collection of items, e.g. creative works or products.
subclass of: CreativeWork
isPartOf: bib.schema.org

PodcastEpisode
type: Class
comment: A single episode of a podcast series.
subclass of: Episode
isPartOf: pending.schema.org
source: https://github.com/schemaorg/schemaorg/issues/373

underName
type: Property
comment: The person or organization the reservation or ticket is for.
domainIncludes: Ticket
domainIncludes: Reservation
rangeIncludes: Organization
rangeIncludes: Person

WearableMeasurementLength
type: WearableMeasurementTypeEnumeration
comment: Represents the length, for example of a dress.
isPartOf: pending.schema.org
source: https://github.com/schemaorg/schemaorg/issues/2811

SpreadsheetDigitalDocument
type: Class
comment: A spreadsheet file.
subclass of: DigitalDocument

WPHeader
type: Class
comment: The header section of the page.
subclass of: WebPageElement

DirectDebit
type: PaymentMethodType
comment: Payment in advance by direct debit from the bank, equivalent to http://purl.org/goodrelations/v1#DirectDebit.

OnlineOnly
type: ItemAvailability
comment: Indicates that the item is available only online.

byMonthWeek
type: Property
comment: Defines the week(s) of the month on which a recurring Event takes place. Specified as an Integer between 1-5. For clarity, byMonthWeek is best used in conjunction with byDay to indicate concepts like the first and third Mondays of a month.
domainIncludes: Schedule
isPartOf: pending.schema.org
rangeIncludes: Integer
source: https://github.com/schemaorg/schemaorg/issues/2599

OrderInTransit
type: OrderStatus
comment: OrderStatus representing that an order is in transit.

SellAction
type: Class
comment: The act of taking money from a buyer in exchange for goods or services rendered. An agent sells an object, product, or service to a buyer for a price. Reciprocal of BuyAction.
subclass of: TradeAction

subStageSuffix
type: Property
comment: The substage, e.g. 'a' for Stage IIIa.
domainIncludes: MedicalConditionStage
isPartOf: health-lifesci.schema.org
rangeIncludes: Text

biologicalRole
type: Property
comment: A role played by the BioChemEntity within a biological context.
domainIncludes: BioChemEntity
isPartOf: pending.schema.org
rangeIncludes: DefinedTerm
source: www.bioschemas.org

recipient
type: Property
comment: A sub property of participant. The participant who is at the receiving end of the action.
sub property of: participant
domainIncludes: AuthorizeAction
domainIncludes: Message
domainIncludes: SendAction
domainIncludes: ReturnAction
domainIncludes: TipAction
domainIncludes: CommunicateAction
domainIncludes: GiveAction
domainIncludes: DonateAction
domainIncludes: PayAction
rangeIncludes: Organization
rangeIncludes: Person
rangeIncludes: ContactPoint
rangeIncludes: Audience

MedicalImagingTechnique
type: Class
comment: Any medical imaging modality typically used for diagnostic purposes. Enumerated type.
subclass of: MedicalEnumeration
isPartOf: health-lifesci.schema.org

Canal
type: Class
comment: A canal, like the Panama Canal.
subclass of: BodyOfWater

ImageGallery
type: Class
comment: Web page type: Image gallery page.
subclass of: MediaGallery

BlogPosting
type: Class
comment: A blog post.
subclass of: SocialMediaPosting

Nonprofit501c22
type: USNonprofitType
comment: Nonprofit501c22: Non-profit type referring to Withdrawal Liability Payment Funds.
isPartOf: pending.schema.org
source: https://github.com/schemaorg/schemaorg/issues/2543

IngredientsHealthAspect
type: HealthAspectEnumeration
comment: Content discussing ingredients-related aspects of a health topic.
isPartOf: pending.schema.org
source: https://github.com/schemaorg/schemaorg/issues/2799

availabilityStarts
type: Property
comment: The beginning of the availability of the product or service included in the offer.
contributor: GoodRelationsTerms
domainIncludes: ActionAccessSpecification
domainIncludes: Demand
domainIncludes: Offer
rangeIncludes: Date
rangeIncludes: DateTime
rangeIncludes: Time
source: https://github.com/schemaorg/schemaorg/issues/1741

dateDeleted
type: Property
comment: The datetime the item was removed from the DataFeed.
domainIncludes: DataFeedItem
rangeIncludes: DateTime
rangeIncludes: Date

PerformAction
type: Class
comment: The act of participating in performance arts.
subclass of: PlayAction

album
type: Property
comment: A music album.
domainIncludes: MusicGroup
rangeIncludes: MusicAlbum

Sunday
type: DayOfWeek
comment: The day of the week between Saturday and Monday.

candidate
type: Property
comment: A sub property of object. The candidate subject of this action.
sub property of: object
domainIncludes: VoteAction
rangeIncludes: Person

MortgageLoan
type: Class
comment: A loan in which property or real estate is used as collateral. (A loan securitized against some real estate.)
subclass of: LoanOrCredit
contributor: FIBO
isPartOf: pending.schema.org
source: https://github.com/schemaorg/schemaorg/issues/1253

RuntimePlatform
type: Class
comment: Specialized software environment that provides the essential infrastructure, libraries, and services required to execute a program.
subclass of: SoftwareApplication
isPartOf: pending.schema.org
source: https://github.com/schemaorg/schemaorg/issues/4575

businessDays
type: Property
comment: Days of the week when the merchant typically operates, indicated via opening hours markup.
domainIncludes: ServicePeriod
domainIncludes: ShippingDeliveryTime
rangeIncludes: DayOfWeek
rangeIncludes: OpeningHoursSpecification
source: https://github.com/schemaorg/schemaorg/issues/2506
source: https://github.com/schemaorg/schemaorg/issues/3617

Person
type: Class
equivalent class: Person
comment: A person (alive, dead, undead, or fictional).
subclass of: Thing
contributor: rNews

StrengthTraining
type: PhysicalActivityCategory
comment: Physical activity that is engaged in to improve muscle and bone strength. Also referred to as resistance training.
isPartOf: health-lifesci.schema.org

weightTotal
type: Property
comment: The permitted total weight of the loaded vehicle, including passengers and cargo and the weight of the empty vehicle.\n\nTypical unit code(s): KGM for kilogram, LBR for pound\n\n* Note 1: You can indicate additional information in the name of the QuantitativeValue node.\n* Note 2: You may also link to a QualitativeValue node that provides additional information using valueReference.\n* Note 3: Note that you can use minValue and maxValue to indicate ranges.
contributor: Automotive Ontology Working Group
domainIncludes: Vehicle
isPartOf: auto.schema.org
rangeIncludes: QuantitativeValue

FrontWheelDriveConfiguration
type: DriveWheelConfigurationValue
comment: Front-wheel drive is a transmission layout where the engine drives the front wheels.
contributor: Automotive Ontology Working Group

benefits
type: Property
comment: Description of benefits associated with the job.
domainIncludes: JobPosting
rangeIncludes: Text
supersededBy: jobBenefits

actors
type: Property
comment: An actor, e.g. in TV, radio, movie, video games etc. Actors can be associated with individual items or with a series, episode, clip.
domainIncludes: TVSeries
domainIncludes: VideoGame
domainIncludes: Episode
domainIncludes: Clip
domainIncludes: Movie
domainIncludes: MovieSeries
domainIncludes: VideoGameSeries
domainIncludes: VideoObject
domainIncludes: RadioSeries
rangeIncludes: Person
supersededBy: actor

itemListElement
type: Property
comment: For itemListElement values, you can use simple strings (e.g. "Peter", "Paul", "Mary"), existing entities, or use ListItem.\n\nText values are best if the elements in the list are plain strings. Existing entities are best for a simple, unordered list of existing things in your data. ListItem is used with ordered lists when you want to provide additional context about the element in that list or when the same item might be in different places in different lists.\n\nNote: The order of elements in your mark-up is not sufficient for indicating the order or elements. Use ListItem with a 'position' property in such cases.
domainIncludes: ItemList
rangeIncludes: Text
rangeIncludes: Thing
rangeIncludes: ListItem

event
type: Property
comment: Upcoming or past event associated with this place, organization, or action.
domainIncludes: InformAction
domainIncludes: JoinAction
domainIncludes: LeaveAction
domainIncludes: Organization
domainIncludes: PlayAction
domainIncludes: Place
domainIncludes: InviteAction
rangeIncludes: Event

AskAction
type: Class
comment: The act of posing a question / favor to someone.\n\nRelated actions:\n\n* ReplyAction: Appears generally as a response to AskAction.
subclass of: CommunicateAction

DECooperativeCharity
type: DENonprofitType
comment: DECooperativeCharity: Non-profit type referring to a charitable Cooperative (German Genossenschaft) that has been recognized by the tax authorities as a charitable non-profit.
isPartOf: pending.schema.org
source: https://github.com/schemaorg/schemaorg/issues/3629

duringMedia
type: Property
comment: A media object representing the circumstances while performing this direction.
domainIncludes: HowToDirection
rangeIncludes: URL
rangeIncludes: MediaObject

startDate
type: Property
equivalent property: hasStartDate
comment: The start date and time of the item (in [ISO 8601 date format](http://en.wikipedia.org/wiki/ISO_8601)).
domainIncludes: Role
domainIncludes: DatedMoneySpecification
domainIncludes: Event
domainIncludes: CreativeWorkSeries
domainIncludes: EducationalOccupationalProgram
domainIncludes: MerchantReturnPolicySeasonalOverride
domainIncludes: Schedule
domainIncludes: CreativeWorkSeason
rangeIncludes: Date
rangeIncludes: DateTime
source: https://github.com/schemaorg/schemaorg/issues/2486

MonetaryGrant
type: Class
comment: A monetary grant.
subclass of: Grant
isPartOf: pending.schema.org
source: FundInfoCollab
source: https://github.com/schemaorg/schemaorg/issues/383

BrainStructure
type: Class
comment: Any anatomical structure which pertains to the soft nervous tissue functioning as the coordinating center of sensation and intellectual and nervous activity.
subclass of: AnatomicalStructure
isPartOf: health-lifesci.schema.org

ITCooperativeCharity
type: ITNonprofitType
comment: ITCooperativeCharity: Non-profit type referring to Cooperatives with charitable missions (Ital. Cooperativa Sociale) according to Italian Law 112 of 2017.
isPartOf: pending.schema.org
source: https://github.com/schemaorg/schemaorg/issues/3629

loanRepaymentForm
type: Property
comment: A form of paying back money previously borrowed from a lender. Repayment usually takes the form of periodic payments that normally include part principal plus interest in each payment.
contributor: FIBO
domainIncludes: LoanOrCredit
isPartOf: pending.schema.org
rangeIncludes: RepaymentSpecification
source: https://github.com/schemaorg/schemaorg/issues/1253

lifeEvent
type: Property
comment: A life event like baptism, communions, Bar Mitzvahs, Aqiqah, Namakarana, Miyamairi, burial, ....
domainIncludes: Person
isPartOf: pending.schema.org
rangeIncludes: Event
source: https://github.com/schemaorg/schemaorg/issues/4540

targetUrl
type: Property
comment: The URL of a node in an established educational framework.
domainIncludes: AlignmentObject
rangeIncludes: URL

publishedBy
type: Property
comment: An agent associated with the publication event.
domainIncludes: PublicationEvent
isPartOf: bib.schema.org
rangeIncludes: Organization
rangeIncludes: Person

hasStore
type: Property
comment: An eCommerce store part of an online marketplace.
domainIncludes: OnlineMarketplace
isPartOf: pending.schema.org
rangeIncludes: OnlineStore
source: https://github.com/schemaorg/schemaorg/issues/4470

Podiatric
type: MedicalSpecialty
comment: Podiatry is the care of the human foot, especially the diagnosis and treatment of foot disorders.
subclass of: MedicalBusiness
isPartOf: health-lifesci.schema.org

price
type: Property
comment: The offer price of a product, or of a price component when attached to PriceSpecification and its subtypes.\n\nUsage guidelines:\n\n* Use the priceCurrency property (with standard formats: [ISO 4217 currency format](http://en.wikipedia.org/wiki/ISO_4217), e.g. "USD"; [Ticker symbol](https://en.wikipedia.org/wiki/List_of_cryptocurrencies) for cryptocurrencies, e.g. "BTC"; well known names for [Local Exchange Trading Systems](https://en.wikipedia.org/wiki/Local_exchange_trading_system) (LETS) and other currency types, e.g. "Ithaca HOUR") instead of including [ambiguous symbols](http://en.wikipedia.org/wiki/Dollar_sign#Currencies_that_use_the_dollar_or_peso_sign) such as '$' in the value.\n* Use '.' (Unicode 'FULL STOP' (U+002E)) rather than ',' to indicate a decimal point. Avoid using these symbols as a readability separator.\n* Note that both [RDFa](http://www.w3.org/TR/xhtml-rdfa-primer/#using-the-content-attribute) and Microdata syntax allow the use of a "content=" attribute for publishing simple machine-readable values alongside more human-friendly formatting.\n* Use values from 0123456789 (Unicode 'DIGIT ZERO' (U+0030) to 'DIGIT NINE' (U+0039)) rather than superficially similar Unicode symbols.
sub property of: hasNumericValue
sub property of: hasAmount
domainIncludes: PriceSpecification
domainIncludes: TradeAction
domainIncludes: DonateAction
domainIncludes: Offer
rangeIncludes: Text
rangeIncludes: Number

EventSeries
type: Class
comment: A series of Events. Included events can relate with the series using the superEvent property. An EventSeries is a collection of events that share some unifying characteristic. For example, "The Olympic Games" is a series, which is repeated regularly. The "2012 London Olympics" can be presented both as an Event in the series "Olympic Games", and as an EventSeries that included a number of sporting competitions as Events. The nature of the association between the events in an EventSeries can vary, but typical examples could include a thematic event series (e.g. topical meetups or classes), or a series of regular events that share a location, attendee group and/or organizers. EventSeries has been defined as a kind of Event to make it easy for publishers to use it in an Event context without worrying about which kinds of series are really event-like enough to call an Event. In general an EventSeries may seem more Event-like when the period of time is compact and when aspects such as location are fixed, but it may also sometimes prove useful to describe a longer-term series as an Event.
subclass of: Series
subclass of: Event
isPartOf: pending.schema.org
source: https://github.com/schemaorg/schemaorg/issues/447

FilmAction
type: Class
comment: The act of capturing sound and moving images on film, video, or digitally.
subclass of: CreateAction

Nonprofit501c3
type: USNonprofitType
comment: Nonprofit501c3: Non-profit type referring to Religious, Educational, Charitable, Scientific, Literary, Testing for Public Safety, Fostering National or International Amateur Sports Competition, or Prevention of Cruelty to Children or Animals Organizations.
isPartOf: pending.schema.org
source: https://github.com/schemaorg/schemaorg/issues/2543

SearchAction
type: Class
comment: The act of searching for an object.\n\nRelated actions:\n\n* FindAction: SearchAction generally leads to a FindAction, but not necessarily.
subclass of: Action

playerType
type: Property
comment: Player type required—for example, Flash or Silverlight.
domainIncludes: MediaObject
rangeIncludes: Text

shippingDestination
type: Property
comment: indicates (possibly multiple) shipping destinations. These can be defined in several ways, e.g. postalCode ranges.
domainIncludes: ShippingConditions
domainIncludes: OfferShippingDetails
domainIncludes: ShippingRateSettings
domainIncludes: DeliveryTimeSettings
rangeIncludes: DefinedRegion
source: https://github.com/schemaorg/schemaorg/issues/3617
source: https://github.com/schemaorg/schemaorg/issues/2506

TaxiStand
type: Class
comment: A taxi stand.
subclass of: CivicStructure

opens
type: Property
comment: The opening hour of the place or service on the given day(s) of the week.
contributor: GoodRelationsTerms
domainIncludes: OpeningHoursSpecification
rangeIncludes: Time

cvdNumC19OFMechVentPats
type: Property
comment: numc19ofmechventpats - ED/OVERFLOW and VENTILATED: Patients with suspected or confirmed COVID-19 who are in the ED or any overflow location awaiting an inpatient bed and on a mechanical ventilator.
domainIncludes: CDCPMDRecord
isPartOf: pending.schema.org
rangeIncludes: Number
source: https://github.com/schemaorg/schemaorg/issues/2521

Otolaryngologic
type: MedicalSpecialty
comment: A specific branch of medical science that is concerned with the ear, nose and throat and their respective disease states.
subclass of: MedicalBusiness
isPartOf: health-lifesci.schema.org

typeOfGood
type: Property
comment: The product that this structured value is referring to.
contributor: GoodRelationsTerms
domainIncludes: OwnershipInfo
domainIncludes: TypeAndQuantityNode
rangeIncludes: Service
rangeIncludes: Product

warning
type: Property
comment: Any FDA or other warnings about the drug (text or URL).
domainIncludes: Drug
isPartOf: health-lifesci.schema.org
rangeIncludes: Text
rangeIncludes: URL

OutOfStock
type: ItemAvailability
comment: Indicates that the item is out of stock.

LoginAction
type: Class
comment: The action of logging into a device or application.
subclass of: ControlAction
isPartOf: pending.schema.org
source: https://github.com/schemaorg/schemaorg/issues/4507

inDefinedTermSet
type: Property
comment: A DefinedTermSet that contains this term.
sub property of: isPartOf
domainIncludes: DefinedTerm
isPartOf: pending.schema.org
rangeIncludes: URL
rangeIncludes: DefinedTermSet
source: https://github.com/schemaorg/schemaorg/issues/894

LodgingBusiness
type: Class
comment: A lodging business, such as a motel, hotel, or inn.
subclass of: LocalBusiness

tocContinuation
type: Property
comment: A HyperTocEntry can have a tocContinuation indicated, which is another HyperTocEntry that would be the default next item to play or render.
domainIncludes: HyperTocEntry
isPartOf: pending.schema.org
rangeIncludes: HyperTocEntry
source: https://github.com/schemaorg/schemaorg/issues/2766

geoDisjoint
type: Property
comment: Represents spatial relations in which two geometries (or the places they represent) are topologically disjoint: "they have no point in common. They form a set of disconnected geometries." (A symmetric relationship, as defined in [DE-9IM](https://en.wikipedia.org/wiki/DE-9IM).)
domainIncludes: Place
domainIncludes: GeospatialGeometry
rangeIncludes: Place
rangeIncludes: GeospatialGeometry

Text
type: DataType
type: Class
comment: Data type: Text.

answerExplanation
type: Property
comment: A step-by-step or full explanation about Answer. Can outline how this Answer was achieved or contain more broad clarification or statement about it.
domainIncludes: Answer
isPartOf: pending.schema.org
rangeIncludes: Comment
rangeIncludes: WebContent
source: https://github.com/schemaorg/schemaorg/issues/2636

pickupTime
type: Property
comment: When a taxi will pick up a passenger or a rental car can be picked up.
domainIncludes: TaxiReservation
domainIncludes: RentalCarReservation
rangeIncludes: DateTime

evidenceLevel
type: Property
comment: Strength of evidence of the data used to formulate the guideline (enumerated).
domainIncludes: MedicalGuideline
isPartOf: health-lifesci.schema.org
rangeIncludes: MedicalEvidenceLevel

ComicCoverArt
type: Class
comment: The artwork on the cover of a comic.
subclass of: ComicStory
subclass of: CoverArt
isPartOf: bib.schema.org

RandomizedTrial
type: MedicalTrialDesign
comment: A randomized trial design.
isPartOf: health-lifesci.schema.org

FoodEstablishmentReservation
type: Class
comment: A reservation to dine at a food-related business.\n\nNote: This type is for information about actual reservations, e.g. in confirmation emails or HTML pages with individual confirmations of reservations.
subclass of: Reservation

commentCount
type: Property
comment: The number of comments this CreativeWork (e.g. Article, Question or Answer) has received. This is most applicable to works published in Web sites with commenting system; additional comments may exist elsewhere.
domainIncludes: CreativeWork
rangeIncludes: Integer

costOrigin
type: Property
comment: Additional details to capture the origin of the cost data. For example, 'Medicare Part B'.
domainIncludes: DrugCost
isPartOf: health-lifesci.schema.org
rangeIncludes: Text

legalStatus
type: Property
comment: The drug or supplement's legal status, including any controlled substance schedules that apply.
domainIncludes: DietarySupplement
domainIncludes: MedicalEntity
domainIncludes: Drug
isPartOf: health-lifesci.schema.org
rangeIncludes: DrugLegalStatus
rangeIncludes: MedicalEnumeration
rangeIncludes: Text

BarOrPub
type: Class
comment: A bar or pub.
subclass of: FoodEstablishment

fuelType
type: Property
comment: The type of fuel suitable for the engine or engines of the vehicle. If the vehicle has only one engine, this property can be attached directly to the vehicle.
contributor: Automotive Ontology Working Group
domainIncludes: Vehicle
domainIncludes: EngineSpecification
rangeIncludes: QualitativeValue
rangeIncludes: Text
rangeIncludes: URL

childMinAge
type: Property
comment: Minimal age of the child.
domainIncludes: ParentAudience
rangeIncludes: Number

PaymentComplete
type: PaymentStatusType
comment: The payment has been received and processed.

isRelatedTo
type: Property
equivalent property: RelatedProduct
comment: A pointer to another, somehow related product (or multiple products).
contributor: GoodRelationsTerms
domainIncludes: Product
domainIncludes: Service
rangeIncludes: Service
rangeIncludes: Product

ExampleMeasurementMethodEnum
type: MeasurementMethodEnum
comment: An example MeasurementMethodEnum (to remove when real enums are added).
isPartOf: pending.schema.org
source: https://github.com/schemaorg/schemaorg/issues/2564

EducationalAudience
type: Class
comment: An EducationalAudience.
subclass of: Audience
contributor: LRMIClass

AskPublicNewsArticle
type: Class
comment: A NewsArticle expressing an open call by a NewsMediaOrganization asking the public for input, insights, clarifications, anecdotes, documentation, etc., on an issue, for reporting purposes.
subclass of: NewsArticle
contributor: TP
isPartOf: pending.schema.org
source: https://github.com/schemaorg/schemaorg/issues/1525

HealthPlanNetwork
type: Class
comment: A US-style health insurance plan network.
subclass of: Intangible
isPartOf: pending.schema.org
source: https://github.com/schemaorg/schemaorg/issues/1062

broadcastDisplayName
type: Property
comment: The name displayed in the channel guide. For many US affiliates, it is the network name.
domainIncludes: BroadcastService
rangeIncludes: Text

certificationStatus
type: Property
comment: Indicates the current status of a certification: active or inactive. See also [gs1:certificationStatus](https://www.gs1.org/voc/certificationStatus).
domainIncludes: Certification
rangeIncludes: CertificationStatusEnumeration
source: https://github.com/schemaorg/schemaorg/issues/3230

ByInvoice
type: PaymentMethodType
comment: Payment by invoice, typically after the goods were delivered, equivalent to http://purl.org/goodrelations/v1#ByInvoice.

busName
type: Property
comment: The name of the bus (e.g. Bolt Express).
domainIncludes: BusTrip
rangeIncludes: Text

ResultsNotAvailable
type: MedicalStudyStatus
comment: Results are not available.
isPartOf: health-lifesci.schema.org

serviceUrl
type: Property
comment: The website to access the service.
domainIncludes: ServiceChannel
rangeIncludes: URL

InvoicePrice
type: PriceTypeEnumeration
comment: Represents the invoice price of an offered product.
isPartOf: pending.schema.org
source: https://github.com/schemaorg/schemaorg/issues/2712

hasDriveThroughService
type: Property
comment: Indicates whether some facility (e.g. FoodEstablishment, CovidTestingFacility) offers a service that can be used by driving through in a car. In the case of CovidTestingFacility such facilities could potentially help with social distancing from other potentially-infected users.
domainIncludes: Place
isPartOf: pending.schema.org
rangeIncludes: Boolean
source: https://github.com/schemaorg/schemaorg/issues/2490

aircraft
type: Property
comment: The kind of aircraft (e.g., "Boeing 747").
domainIncludes: Flight
rangeIncludes: Text
rangeIncludes: Vehicle

interactingDrug
type: Property
comment: Another drug that is known to interact with this drug in a way that impacts the effect of this drug or causes a risk to the patient. Note: disease interactions are typically captured as contraindications.
domainIncludes: Drug
isPartOf: health-lifesci.schema.org
rangeIncludes: Drug

course
type: Property
comment: A sub property of location. The course where this action was taken.
sub property of: location
domainIncludes: ExerciseAction
rangeIncludes: Place
supersededBy: exerciseCourse

name
type: Property
equivalent property: hasName
equivalent property: title
comment: The name of the item.
sub property of: label
domainIncludes: Thing
rangeIncludes: Text

LegalForceStatus
type: Class
comment: A list of possible statuses for the legal force of a legislation.
subclass of: StatusEnumeration
contributor: ELI
isPartOf: pending.schema.org
source: https://github.com/schemaorg/schemaorg/issues/1156
source: eli

recipe
type: Property
comment: A sub property of instrument. The recipe/instructions used to perform the action.
sub property of: instrument
domainIncludes: CookAction
rangeIncludes: Recipe

DrugCostCategory
type: Class
comment: Enumerated categories of medical drug costs.
subclass of: MedicalEnumeration
isPartOf: health-lifesci.schema.org

statType
type: Property
comment: Indicates the kind of statistic represented by a StatisticalVariable, e.g. mean, count etc. The value of statType is a property, either from within Schema.org (e.g. median, marginOfError, maxValue, minValue) or from other compatible (e.g. RDF) systems such as DataCommons.org or Wikidata.org.
domainIncludes: StatisticalVariable
isPartOf: pending.schema.org
rangeIncludes: Property
rangeIncludes: Text
rangeIncludes: URL
source: https://github.com/schemaorg/schemaorg/issues/2564

percentile10
type: Property
comment: The 10th percentile value.
domainIncludes: QuantitativeValueDistribution
rangeIncludes: Number
source: https://github.com/schemaorg/schemaorg/issues/1698

DemoGameAvailability
type: GameAvailabilityEnumeration
comment: Indicates demo game availability, i.e. a somehow limited demonstration of the full game.
isPartOf: pending.schema.org
source: https://github.com/schemaorg/schemaorg/issues/3058

value
type: Property
comment: The value of a QuantitativeValue (including Observation) or property value node.\n\n* For QuantitativeValue and MonetaryAmount, the recommended type for values is 'Number'.\n* For PropertyValue, it can be 'Text', 'Number', 'Boolean', or 'StructuredValue'.\n* Use values from 0123456789 (Unicode 'DIGIT ZERO' (U+0030) to 'DIGIT NINE' (U+0039)) rather than superficially similar Unicode symbols.\n* Use '.' (Unicode 'FULL STOP' (U+002E)) rather than ',' to indicate a decimal point. Avoid using these symbols as a readability separator.
contributor: GoodRelationsTerms
domainIncludes: MonetaryAmount
domainIncludes: PropertyValue
domainIncludes: QuantitativeValue
rangeIncludes: StructuredValue
rangeIncludes: Text
rangeIncludes: Number
rangeIncludes: Boolean

AnalysisNewsArticle
type: Class
comment: An AnalysisNewsArticle is a NewsArticle that, while based on factual reporting, incorporates the expertise of the author/producer, offering interpretations and conclusions.
subclass of: NewsArticle
contributor: TP
isPartOf: pending.schema.org
source: https://github.com/schemaorg/schemaorg/issues/1525

dataset
type: Property
comment: A dataset contained in this catalog.
domainIncludes: DataCatalog
inverseOf: includedInDataCatalog
rangeIncludes: Dataset

letterer
type: Property
comment: The individual who adds lettering, including speech balloons and sound effects, to artwork.
domainIncludes: ComicIssue
domainIncludes: VisualArtwork
domainIncludes: ComicStory
isPartOf: bib.schema.org
rangeIncludes: Person

geoCrosses
type: Property
comment: Represents a relationship between two geometries (or the places they represent), relating a geometry to another that crosses it: "a crosses b: they have some but not all interior points in common, and the dimension of the intersection is less than that of at least one of them". As defined in [DE-9IM](https://en.wikipedia.org/wiki/DE-9IM).
domainIncludes: Place
domainIncludes: GeospatialGeometry
rangeIncludes: GeospatialGeometry
rangeIncludes: Place

musicCompositionForm
type: Property
comment: The type of composition (e.g. overture, sonata, symphony, etc.).
contributor: MBZ
domainIncludes: MusicComposition
rangeIncludes: Text

mechanismOfAction
type: Property
comment: The specific biochemical interaction through which this drug or supplement produces its pharmacological effect.
domainIncludes: Drug
domainIncludes: DietarySupplement
isPartOf: health-lifesci.schema.org
rangeIncludes: Text

Terminated
type: MedicalStudyStatus
comment: Terminated.
isPartOf: health-lifesci.schema.org

serviceOutput
type: Property
comment: The tangible thing generated by the service, e.g. a passport, permit, etc.
domainIncludes: Service
rangeIncludes: Thing

priceComponent
type: Property
comment: This property links to all UnitPriceSpecification nodes that apply in parallel for the CompoundPriceSpecification node.
contributor: GoodRelationsTerms
domainIncludes: CompoundPriceSpecification
rangeIncludes: PriceSpecification

ExerciseAction
type: Class
comment: The act of participating in exertive activity for the purposes of improving health and fitness.
subclass of: PlayAction

question
type: Property
comment: A sub property of object. A question.
sub property of: object
domainIncludes: AskAction
rangeIncludes: Question

securityScreening
type: Property
comment: The type of security screening the passenger is subject to.
domainIncludes: FlightReservation
rangeIncludes: Text

TVEpisode
type: Class
comment: A TV episode which can be part of a series or season.
subclass of: Episode

wheelbase
type: Property
comment: The distance between the centers of the front and rear wheels.\n\nTypical unit code(s): CMT for centimeters, MTR for meters, INH for inches, FOT for foot/feet.
contributor: Automotive Ontology Working Group
domainIncludes: Vehicle
isPartOf: auto.schema.org
rangeIncludes: QuantitativeValue

intensity
type: Property
comment: Quantitative measure gauging the degree of force involved in the exercise, for example, heartbeats per minute. May include the velocity of the movement.
domainIncludes: ExercisePlan
isPartOf: health-lifesci.schema.org
rangeIncludes: QuantitativeValue
rangeIncludes: Text

textValue
type: Property
comment: Text value being annotated.
domainIncludes: PronounceableText
isPartOf: pending.schema.org
rangeIncludes: Text
source: https://github.com/schemaorg/schemaorg/issues/2108

Nonprofit501a
type: USNonprofitType
comment: Nonprofit501a: Non-profit type referring to Farmers’ Cooperative Associations.
isPartOf: pending.schema.org
source: https://github.com/schemaorg/schemaorg/issues/2543

netWorth
type: Property
comment: The total financial value of the person as calculated by subtracting the total value of liabilities from the total value of assets.
domainIncludes: Person
rangeIncludes: PriceSpecification
rangeIncludes: MonetaryAmount

ResetPasswordAction
type: Class
comment: The action of resetting the password of a device or application.
subclass of: ControlAction
isPartOf: pending.schema.org
source: https://github.com/schemaorg/schemaorg/issues/4507

confirmationNumber
type: Property
comment: A number that confirms the given order or payment has been received.
sub property of: identifier
domainIncludes: Invoice
domainIncludes: Order
rangeIncludes: Text

model
type: Property
equivalent property: ModelName
comment: The model of the product. Use with the URL of a ProductModel or a textual representation of the model identifier. The URL of the ProductModel can be from an external source. It is recommended to additionally provide strong product identifiers via the gtin8/gtin13/gtin14 and mpn properties.
sub property of: isClassifiedBy
domainIncludes: Product
rangeIncludes: Text
rangeIncludes: ProductModel

hasSponsorshipOffer
type: Property
comment: An offer to sponsor the event, for example, Sponsorship Prospectus, Sponsorship Opportunities, or Sponsor Packages.
domainIncludes: Event
isPartOf: pending.schema.org
rangeIncludes: Offer
source: https://github.com/schemaorg/schemaorg/issues/4495

FulfillmentTypeCollectionPoint
type: FulfillmentTypeEnumeration
comment: Fulfillment to a collection point location.
isPartOf: pending.schema.org
source: https://github.com/schemaorg/schemaorg/issues/3617

AuthorizeAction
type: Class
comment: The act of granting permission to an object.
subclass of: AllocateAction

EmploymentAgency
type: Class
comment: An employment agency.
subclass of: LocalBusiness

isResizable
type: Property
comment: Whether the 3DModel allows resizing. For example, room layout applications often do not allow 3DModel elements to be resized to reflect reality.
domainIncludes: 3DModel
isPartOf: pending.schema.org
rangeIncludes: Boolean
source: https://github.com/schemaorg/schemaorg/issues/2394

WearableSizeGroupExtraShort
type: WearableSizeGroupEnumeration
comment: Size group "Extra Short" for wearables.
isPartOf: pending.schema.org
source: https://github.com/schemaorg/schemaorg/issues/2811

StrikethroughPrice
type: PriceTypeEnumeration
comment: Represents the strikethrough price (the previous advertised price) of an offered product.
isPartOf: pending.schema.org
source: https://github.com/schemaorg/schemaorg/issues/3583

MedicalTrial
type: Class
comment: A medical trial is a type of medical study that uses a scientific process to compare the safety and efficacy of medical therapies or medical procedures. In general, medical trials are controlled and subjects are allocated at random to the different treatment and/or control groups.
subclass of: MedicalStudy
isPartOf: health-lifesci.schema.org

physicalRequirement
type: Property
comment: A description of the types of physical activity associated with the job. Defined terms such as those in O*net may be used, but note that there is no way to specify the level of ability as well as its nature when using a defined term.
domainIncludes: JobPosting
isPartOf: pending.schema.org
rangeIncludes: Text
rangeIncludes: URL
rangeIncludes: DefinedTerm
source: https://github.com/schemaorg/schemaorg/issues/2384

recipeCuisine
type: Property
comment: The cuisine of the recipe (for example, French or Ethiopian).
domainIncludes: Recipe
rangeIncludes: Text

FinancialService
type: Class
comment: Financial services business.
subclass of: LocalBusiness

StructuredValue
type: Class
comment: Structured values are used when the value of a property has a more complex structure than simply being a textual value or a reference to another thing.
subclass of: Intangible

MobileApplication
type: Class
comment: A software application designed specifically to work well on a mobile device such as a telephone.
subclass of: SoftwareApplication

EngineSpecification
type: Class
comment: Information about the engine of the vehicle. A vehicle can have multiple engines represented by multiple engine specification entities.
subclass of: StructuredValue
contributor: Automotive Ontology Working Group

HealthPlanFormulary
type: Class
comment: For a given health insurance plan, the specification for costs and coverage of prescription drugs.
subclass of: Intangible
isPartOf: pending.schema.org
source: https://github.com/schemaorg/schemaorg/issues/1062

BorrowAction
type: Class
comment: The act of obtaining an object under an agreement to return it at a later date. Reciprocal of LendAction.\n\nRelated actions:\n\n* LendAction: Reciprocal of BorrowAction.
subclass of: TransferAction

hasTierBenefit
type: Property
comment: A member benefit for a particular tier of a loyalty program.
domainIncludes: MemberProgramTier
rangeIncludes: TierBenefitEnumeration
source: https://github.com/schemaorg/schemaorg/issues/3563

httpMethod
type: Property
comment: An HTTP method that specifies the appropriate HTTP method for a request to an HTTP EntryPoint. Values are capitalized strings as used in HTTP.
domainIncludes: EntryPoint
rangeIncludes: Text

TechArticle
type: Class
comment: A technical article - Example: How-to (task) topics, step-by-step, procedural troubleshooting, specifications, etc.
subclass of: Article

Claim
type: Class
comment: A Claim in Schema.org represents a specific, factually-oriented claim that could be the itemReviewed in a ClaimReview. The content of a claim can be summarized with the text property. Variations on well known claims can have their common identity indicated via sameAs links, and summarized with a name. Ideally, a Claim description includes enough contextual information to minimize the risk of ambiguity or inclarity. In practice, many claims are better understood in the context in which they appear or the interpretations provided by claim reviews. Beyond ClaimReview, the Claim type can be associated with related creative works - for example a ScholarlyArticle or Question might be about some Claim. At this time, Schema.org does not define any types of relationship between claims. This is a natural area for future exploration.
subclass of: CreativeWork
isPartOf: pending.schema.org
source: https://github.com/schemaorg/schemaorg/issues/1828

WPSideBar
type: Class
comment: A sidebar section of the page.
subclass of: WebPageElement

accessMode
type: Property
comment: The human sensory perceptual system or cognitive faculty through which a person may process or perceive the intellectual content of a resource, not including any adaptations of the content (e.g., text alternatives for images). Values should be drawn from the [approved vocabulary](https://www.w3.org/2021/a11y-discov-vocab/latest/#accessMode-vocabulary).
domainIncludes: CreativeWork
rangeIncludes: Text
source: https://github.com/schemaorg/schemaorg/issues/1100

merchantReturnLink
type: Property
comment: Specifies a Web page or service by URL, for product returns.
domainIncludes: MerchantReturnPolicy
isPartOf: pending.schema.org
rangeIncludes: URL
source: https://github.com/schemaorg/schemaorg/issues/2288

issn
type: Property
equivalent property: issn
comment: The International Standard Serial Number (ISSN) that identifies this serial publication. You can repeat this property to identify different formats of, or the linking ISSN (ISSN-L) for, this serial publication.
sub property of: identifier
contributor: bibex
domainIncludes: Dataset
domainIncludes: WebSite
domainIncludes: CreativeWorkSeries
domainIncludes: Blog
rangeIncludes: Text

ReserveAction
type: Class
comment: Reserving a concrete object.\n\nRelated actions:\n\n* ScheduleAction: Unlike ScheduleAction, ReserveAction reserves concrete objects (e.g. a table, a hotel) towards a time slot / spatial allocation.
subclass of: PlanAction

screenshot
type: Property
comment: A link to a screenshot image of the app.
domainIncludes: SoftwareApplication
rangeIncludes: URL
rangeIncludes: ImageObject

position
type: Property
comment: The position of an item in a series or sequence of items.
domainIncludes: CreativeWork
domainIncludes: ListItem
rangeIncludes: Text
rangeIncludes: Integer

OfferShippingDetails
type: Class
comment: OfferShippingDetails represents information about shipping destinations. Multiple of these entities can be used to represent different shipping rates for different destinations: One entity for Alaska/Hawaii. A different one for continental US. A different one for all France. Multiple of these entities can be used to represent different shipping costs and delivery times. Two entities that are identical but differ in rate and time: E.g. Cheaper and slower: $5 in 5-7 days or Fast and expensive: $15 in 1-2 days.
subclass of: StructuredValue
source: https://github.com/schemaorg/schemaorg/issues/2506

identifyingTest
type: Property
comment: A diagnostic test that can identify this sign.
domainIncludes: MedicalSign
isPartOf: health-lifesci.schema.org
rangeIncludes: MedicalTest

datasetTimeInterval
type: Property
comment: The range of temporal applicability of a dataset, e.g. for a 2011 census dataset, the year 2011 (in ISO 8601 time interval format).
domainIncludes: Dataset
rangeIncludes: DateTime
supersededBy: temporalCoverage

cvdNumICUBeds
type: Property
comment: numicubeds - ICU BEDS: Total number of staffed inpatient intensive care unit (ICU) beds.
domainIncludes: CDCPMDRecord
isPartOf: pending.schema.org
rangeIncludes: Number
source: https://github.com/schemaorg/schemaorg/issues/2521

ReviewAction
type: Class
comment: The act of producing a balanced opinion about the object for an audience. An agent reviews an object with participants resulting in a review.
subclass of: AssessAction

broadcastFrequency
type: Property
comment: The frequency used for over-the-air broadcasts. Numeric values or simple ranges, e.g. 87-99. In addition a shortcut idiom is supported for frequencies of AM and FM radio channels, e.g. "87 FM".
domainIncludes: BroadcastChannel
domainIncludes: BroadcastService
rangeIncludes: Text
rangeIncludes: BroadcastFrequencySpecification
source: https://github.com/schemaorg/schemaorg/issues/1004

Continent
type: Class
equivalent class: Continent
comment: One of the continents (for example, Europe or Africa).
subclass of: Landform

ReadAction
type: Class
comment: The act of consuming written content.
subclass of: ConsumeAction

RoofingContractor
type: Class
comment: A roofing contractor.
subclass of: HomeAndConstructionBusiness

speechToTextMarkup
type: Property
comment: Form of markup used. eg. [SSML](https://www.w3.org/TR/speech-synthesis11) or [IPA](https://www.wikidata.org/wiki/Property:P898).
domainIncludes: PronounceableText
isPartOf: pending.schema.org
rangeIncludes: Text
source: https://github.com/schemaorg/schemaorg/issues/2108

RelatedTopicsHealthAspect
type: HealthAspectEnumeration
comment: Other prominent or relevant topics tied to the main topic.
isPartOf: pending.schema.org
source: https://github.com/schemaorg/schemaorg/issues/2374

DryCleaningOrLaundry
type: Class
comment: A dry-cleaning business.
subclass of: LocalBusiness

employerOverview
type: Property
comment: A description of the employer, career opportunities and work environment for this position.
domainIncludes: JobPosting
isPartOf: pending.schema.org
rangeIncludes: Text
source: https://github.com/schemaorg/schemaorg/issues/2396

Clip
type: Class
comment: A short TV or radio program or a segment/part of a program.
subclass of: CreativeWork

steeringPosition
type: Property
comment: The position of the steering wheel or similar device (mostly for cars).
contributor: Automotive Ontology Working Group
domainIncludes: Vehicle
rangeIncludes: SteeringPositionValue

MedicalSignOrSymptom
type: Class
comment: Any feature associated or not with a medical condition. In medicine a symptom is generally subjective while a sign is objective.
subclass of: MedicalCondition
isPartOf: health-lifesci.schema.org

StatisticalVariable
type: Class
comment: StatisticalVariable represents any type of statistical metric that can be measured at a place and time. The usage pattern for StatisticalVariable is typically expressed using Observation with an explicit populationType, which is a type, typically drawn from Schema.org. Each StatisticalVariable is marked as a ConstraintNode, meaning that some properties (those listed using constraintProperty) serve in this setting solely to define the statistical variable rather than literally describe a specific person, place or thing. For example, a StatisticalVariable Median_Height_Person_Female representing the median height of women, could be written as follows: the population type is Person; the measuredProperty height; the statType median; the gender Female. It is important to note that there are many kinds of scientific quantitative observation which are not fully, perfectly or unambiguously described following this pattern, or with solely Schema.org terminology. The approach taken here is designed to allow partial, incremental or minimal description of StatisticalVariables, and the use of detailed sets of entity and property IDs from external repositories. The measurementMethod, unitCode and unitText properties can also be used to clarify the specific nature and notation of an observed measurement.
subclass of: ConstraintNode
isPartOf: pending.schema.org
source: https://github.com/schemaorg/schemaorg/issues/2564

GroceryStore
type: Class
comment: A grocery store.
subclass of: Store

LodgingReservation
type: Class
comment: A reservation for lodging at a hotel, motel, inn, etc.\n\nNote: This type is for information about actual reservations, e.g. in confirmation emails or HTML pages with individual confirmations of reservations.
subclass of: Reservation

availableDeliveryMethod
type: Property
comment: The delivery method(s) available for this offer.
contributor: GoodRelationsTerms
domainIncludes: Demand
domainIncludes: Offer
rangeIncludes: DeliveryMethod

seasonNumber
type: Property
comment: Position of the season within an ordered group of seasons.
sub property of: position
domainIncludes: CreativeWorkSeason
rangeIncludes: Integer
rangeIncludes: Text

sourcedFrom
type: Property
comment: The neurological pathway that originates the neurons.
domainIncludes: Nerve
isPartOf: health-lifesci.schema.org
rangeIncludes: BrainStructure

CT
type: MedicalImagingTechnique
comment: X-ray computed tomography imaging.
isPartOf: health-lifesci.schema.org

HealthAndBeautyBusiness
type: Class
comment: Health and beauty.
subclass of: LocalBusiness

RisksOrComplicationsHealthAspect
type: HealthAspectEnumeration
comment: Information about the risk factors and possible complications that may follow a topic.
isPartOf: pending.schema.org
source: https://github.com/schemaorg/schemaorg/issues/2374

subTest
type: Property
comment: A component test of the panel.
domainIncludes: MedicalTestPanel
isPartOf: health-lifesci.schema.org
rangeIncludes: MedicalTest

broker
type: Property
comment: An entity that arranges for an exchange between a buyer and a seller. In most cases a broker never acquires or releases ownership of a product or service involved in an exchange. If it is not clear whether an entity is a broker, seller, or buyer, the latter two terms are preferred.
domainIncludes: Reservation
domainIncludes: Service
domainIncludes: Order
domainIncludes: Invoice
rangeIncludes: Organization
rangeIncludes: Person

TravelAction
type: Class
comment: The act of traveling from a fromLocation to a destination by a specified mode of transport, optionally with participants.
subclass of: MoveAction

instructor
type: Property
comment: A person assigned to instruct or provide instructional assistance for the CourseInstance.
domainIncludes: CourseInstance
rangeIncludes: Person

variantCover
type: Property
comment: A description of the variant cover for the issue, if the issue is a variant printing. For example, "Bryan Hitch Variant Cover" or "2nd Printing Variant".
domainIncludes: ComicIssue
isPartOf: bib.schema.org
rangeIncludes: Text

publisherImprint
type: Property
comment: The publishing division which published the comic.
domainIncludes: CreativeWork
isPartOf: bib.schema.org
rangeIncludes: Organization

XPathType
type: Class
comment: Text representing an XPath (typically but not necessarily version 1.0).
subclass of: Text
isPartOf: pending.schema.org
source: https://github.com/schemaorg/schemaorg/issues/1672

arrivalBusStop
type: Property
comment: The stop or station from which the bus arrives.
domainIncludes: BusTrip
rangeIncludes: BusStation
rangeIncludes: BusStop

includedComposition
type: Property
comment: Smaller compositions included in this work (e.g. a movement in a symphony).
contributor: MBZ
domainIncludes: MusicComposition
rangeIncludes: MusicComposition

LivingWithHealthAspect
type: HealthAspectEnumeration
comment: Information about coping or life related to the topic.
isPartOf: pending.schema.org
source: https://github.com/schemaorg/schemaorg/issues/2374

CDFormat
type: MusicReleaseFormatType
comment: CDFormat.
contributor: MBZ

NLNonprofitType
type: Class
comment: NLNonprofitType: Non-profit organization type originating from the Netherlands.
subclass of: NonprofitType
isPartOf: pending.schema.org
source: https://github.com/schemaorg/schemaorg/issues/2543

providesService
type: Property
comment: The service provided by this channel.
domainIncludes: ServiceChannel
rangeIncludes: Service

associatedReview
type: Property
comment: An associated Review.
domainIncludes: Review
isPartOf: pending.schema.org
rangeIncludes: Review
source: https://github.com/schemaorg/schemaorg/issues/2450

GovernmentOffice
type: Class
comment: A government office—for example, an IRS or DMV office.
subclass of: LocalBusiness

addressCountry
type: Property
comment: The country. Recommended to be in 2-letter [ISO 3166-1 alpha-2](http://en.wikipedia.org/wiki/ISO_3166-1) format, for example "US". For backward compatibility, a 3-letter [ISO 3166-1 alpha-3](https://en.wikipedia.org/wiki/ISO_3166-1_alpha-3) country code such as "SGP" or a full country name such as "Singapore" can also be used.
domainIncludes: PostalAddress
domainIncludes: GeoShape
domainIncludes: GeoCoordinates
domainIncludes: DefinedRegion
rangeIncludes: Country
rangeIncludes: Text
source: https://github.com/schemaorg/schemaorg/issues/2506

EBook
type: BookFormatType
comment: Book format: Ebook.

paymentMethodType
type: Property
comment: The type of a payment method.
domainIncludes: PaymentMethod
isPartOf: pending.schema.org
rangeIncludes: PaymentMethodType
source: https://github.com/schemaorg/schemaorg/issues/3537

occupancy
type: Property
comment: The allowed total occupancy for the accommodation in persons (including infants etc). For individual accommodations, this is not necessarily the legal maximum but defines the permitted usage as per the contractual agreement (e.g. a double room used by a single person). Typical unit code(s): C62 for person.
contributor: STI Accommodation Ontology
domainIncludes: Suite
domainIncludes: SingleFamilyResidence
domainIncludes: Accommodation
domainIncludes: HotelRoom
domainIncludes: Apartment
rangeIncludes: QuantitativeValue

identifier
type: Property
equivalent property: identifier
equivalent property: identifiedBy
comment: The identifier property represents any kind of identifier for any kind of Thing, such as ISBNs, GTIN codes, UUIDs etc. Schema.org provides dedicated properties for representing many of these, either as textual strings or as URL (URI) links. See [background notes](/docs/datamodel.html#identifierBg) for more details.
domainIncludes: Thing
rangeIncludes: Text
rangeIncludes: URL
rangeIncludes: PropertyValue

MusculoskeletalExam
type: PhysicalExam
comment: Musculoskeletal system clinical examination.
isPartOf: health-lifesci.schema.org

StatisticalPopulation
type: Class
comment: A StatisticalPopulation is a set of instances of a certain given type that satisfy some set of constraints. The property populationType is used to specify the type. Any property that can be used on instances of that type can appear on the statistical population. For example, a StatisticalPopulation representing all Persons with a homeLocation of East Podunk California would be described by applying the appropriate homeLocation and populationType properties to a StatisticalPopulation item that stands for that set of people. The properties numConstraints and constraintProperty are used to specify which of the populations properties are used to specify the population. Note that the sense of "population" used here is the general sense of a statistical population, and does not imply that the population consists of people. For example, a populationType of Event or NewsArticle could be used. See also Observation, where a populationType such as Person or Event can be indicated directly. In most cases it may be better to use StatisticalVariable instead of StatisticalPopulation.
subclass of: Intangible
isPartOf: pending.schema.org
source: https://github.com/schemaorg/schemaorg/issues/2291

data
type: Property
comment: Data associated with the event, like for instance a log message.
domainIncludes: InstantaneousEvent
isPartOf: pending.schema.org
rangeIncludes: Thing
source: https://github.com/schemaorg/schemaorg/issues/4527

episode
type: Property
comment: An episode of a TV, radio or game media within a series or season.
sub property of: hasPart
domainIncludes: RadioSeries
domainIncludes: TVSeries
domainIncludes: CreativeWorkSeason
domainIncludes: VideoGameSeries
rangeIncludes: Episode

issuedBy
type: Property
comment: The organization issuing the item, for example a Permit, Ticket, or Certification.
domainIncludes: Certification
domainIncludes: Ticket
domainIncludes: Permit
rangeIncludes: Organization

title
type: Property
comment: The title of the job.
domainIncludes: JobPosting
rangeIncludes: Text

DonateAction
type: Class
comment: The act of providing goods, services, or money without compensation, often for philanthropic reasons.
subclass of: TransferAction

incentivizedItem
type: Property
comment: The type or specific product(s) and/or service(s) being incentivized. DefinedTermSets are used for product and service categories such as the United Nations Standard Products and Services Code: { "@type": "DefinedTerm", "inDefinedTermSet": "https://www.unspsc.org/", "termCode": "261315XX", "name": "Photovoltaic module" } For a specific product or service, use the Product type: { "@type": "Product", "name": "Kenmore White 17" Microwave", } For multiple different incentivized items, use multiple DefinedTerm or Product.
domainIncludes: FinancialIncentive
isPartOf: pending.schema.org
rangeIncludes: Product
rangeIncludes: DefinedTerm
source: https://github.com/schemaorg/schemaorg/issues/3572

numberOfBathroomsTotal
type: Property
comment: The total integer number of bathrooms in some Accommodation, following real estate conventions as [documented in RESO](https://ddwiki.reso.org/display/DDW17/BathroomsTotalInteger+Field): "The simple sum of the number of bathrooms. For example for a property with two Full Bathrooms and one Half Bathroom, the Bathrooms Total Integer will be 3.". See also numberOfRooms.
domainIncludes: Accommodation
domainIncludes: FloorPlan
isPartOf: pending.schema.org
rangeIncludes: Integer
source: https://github.com/schemaorg/schemaorg/issues/2373

LeisureTimeActivity
type: PhysicalActivityCategory
comment: Any physical activity engaged in for recreational purposes. Examples may include ballroom dancing, roller skating, canoeing, fishing, etc.
isPartOf: health-lifesci.schema.org

ShortStory
type: Class
comment: Short story or tale. A brief work of literature, usually written in narrative prose.
subclass of: CreativeWork
isPartOf: pending.schema.org
source: https://github.com/schemaorg/schemaorg/issues/1976

eligibleQuantity
type: Property
comment: The interval and unit of measurement of ordering quantities for which the offer or price specification is valid. This allows e.g. specifying that a certain freight charge is valid only for a certain quantity.
contributor: GoodRelationsTerms
domainIncludes: Offer
domainIncludes: PriceSpecification
domainIncludes: Demand
rangeIncludes: QuantitativeValue

mainEntityOfPage
type: Property
comment: Indicates a page (or other CreativeWork) for which this thing is the main entity being described. See [background notes](/docs/datamodel.html#mainEntityBackground) for details.
domainIncludes: Thing
inverseOf: mainEntity
rangeIncludes: CreativeWork
rangeIncludes: URL

MedicalResearcher
type: MedicalAudienceType
comment: Medical researchers.
isPartOf: health-lifesci.schema.org

MedicalTherapy
type: Class
comment: Any medical intervention designed to prevent, treat, and cure human diseases and medical conditions, including both curative and palliative therapies. Medical therapies are typically processes of care relying upon pharmacotherapy, behavioral therapy, supportive therapy (with fluid or nutrition for example), or detoxification (e.g. hemodialysis) aimed at improving or preventing a health condition.
subclass of: TherapeuticProcedure
isPartOf: health-lifesci.schema.org

DrugStrength
type: Class
comment: A specific strength in which a medical drug is available in a specific country.
subclass of: MedicalIntangible
isPartOf: health-lifesci.schema.org

costPerUnit
type: Property
comment: The cost per unit of the drug.
domainIncludes: DrugCost
isPartOf: health-lifesci.schema.org
rangeIncludes: QualitativeValue
rangeIncludes: Text
rangeIncludes: Number

numberOfDoors
type: Property
comment: The number of doors.\n\nTypical unit code(s): C62.
contributor: Automotive Ontology Working Group
domainIncludes: Vehicle
rangeIncludes: QuantitativeValue
rangeIncludes: Number

BrokerageAccount
type: Class
comment: An account that allows an investor to deposit funds and place investment orders with a licensed broker or brokerage firm.
subclass of: InvestmentOrDeposit
contributor: FIBO
isPartOf: pending.schema.org
source: https://github.com/schemaorg/schemaorg/issues/1253

NotYetRecruiting
type: MedicalStudyStatus
comment: Not yet recruiting.
isPartOf: health-lifesci.schema.org

WeaponConsideration
type: AdultOrientedEnumeration
comment: The item is intended to induce bodily harm, for example guns, mace, combat knives, brass knuckles, nail or other bombs, and spears.
isPartOf: pending.schema.org
source: https://github.com/schemaorg/schemaorg/issues/2989

audience
type: Property
equivalent property: audience
comment: An intended audience, i.e. a group for whom something was created.
domainIncludes: CreativeWork
domainIncludes: Product
domainIncludes: Service
domainIncludes: LodgingBusiness
domainIncludes: Event
domainIncludes: PlayAction
rangeIncludes: Audience

BodyOfWater
type: Class
comment: A body of water, such as a sea, ocean, or lake.
subclass of: Landform

Nonprofit501c7
type: USNonprofitType
comment: Nonprofit501c7: Non-profit type referring to Social and Recreational Clubs.
isPartOf: pending.schema.org
source: https://github.com/schemaorg/schemaorg/issues/2543

numberOfBedrooms
type: Property
comment: The total integer number of bedrooms in a some Accommodation, ApartmentComplex or FloorPlan.
domainIncludes: Accommodation
domainIncludes: FloorPlan
domainIncludes: ApartmentComplex
isPartOf: pending.schema.org
rangeIncludes: QuantitativeValue
rangeIncludes: Number
source: https://github.com/schemaorg/schemaorg/issues/2373

greaterOrEqual
type: Property
comment: This ordering relation for qualitative values indicates that the subject is greater than or equal to the object.
contributor: GoodRelationsTerms
domainIncludes: QualitativeValue
rangeIncludes: QualitativeValue

RadioSeason
type: Class
comment: Season dedicated to radio broadcast and associated online delivery.
subclass of: CreativeWorkSeason

relatedLink
type: Property
comment: A link related to this web page, for example to other related web pages.
domainIncludes: WebPage
rangeIncludes: URL

guidelineDate
type: Property
comment: Date on which this guideline's recommendation was made.
domainIncludes: MedicalGuideline
isPartOf: health-lifesci.schema.org
rangeIncludes: Date

subOrganization
type: Property
equivalent property: subOrganization
equivalent property: hasSubsidiary
comment: A relationship between two organizations where the first includes the second, e.g., as a subsidiary. See also: the more specific 'department' property.
domainIncludes: Organization
inverseOf: parentOrganization
rangeIncludes: Organization

ReportageNewsArticle
type: Class
comment: The ReportageNewsArticle type is a subtype of NewsArticle representing news articles which are the result of journalistic news reporting conventions. In practice many news publishers produce a wide variety of article types, many of which might be considered a NewsArticle but not a ReportageNewsArticle. For example, opinion pieces, reviews, analysis, sponsored or satirical articles, or articles that combine several of these elements. The ReportageNewsArticle type is based on a stricter ideal for "news" as a work of journalism, with articles based on factual information either observed or verified by the author, or reported and verified from knowledgeable sources. This often includes perspectives from multiple viewpoints on a particular issue (distinguishing news reports from public relations or propaganda). News reports in the ReportageNewsArticle sense de-emphasize the opinion of the author, with commentary and value judgements typically expressed elsewhere. A ReportageNewsArticle which goes deeper into analysis can also be marked with an additional type of AnalysisNewsArticle.
subclass of: NewsArticle
contributor: TP
isPartOf: pending.schema.org
source: https://github.com/schemaorg/schemaorg/issues/1525

Barcode
type: Class
comment: An image of a visual machine-readable code such as a barcode or QR code.
subclass of: ImageObject

BodyMeasurementWaist
type: BodyMeasurementTypeEnumeration
comment: Girth of natural waistline (between hip bones and lower ribs). Used, for example, to fit pants.
isPartOf: pending.schema.org
source: https://github.com/schemaorg/schemaorg/issues/2811

IncentiveTypeTaxCredit
type: IncentiveType
comment: An incentive that directly reduces the amount of tax owed by the recipient.
isPartOf: pending.schema.org
source: https://github.com/schemaorg/schemaorg/issues/3572

director
type: Property
comment: A director of e.g. TV, radio, movie, video gaming etc. content, or of an event. Directors can be associated with individual items or with a series, episode, clip.
domainIncludes: Event
domainIncludes: VideoObject
domainIncludes: RadioSeries
domainIncludes: TVSeries
domainIncludes: VideoGame
domainIncludes: Episode
domainIncludes: Clip
domainIncludes: Movie
domainIncludes: CreativeWorkSeason
domainIncludes: MovieSeries
domainIncludes: VideoGameSeries
rangeIncludes: Person

proficiencyLevel
type: Property
comment: Proficiency needed for this content; expected values: 'Beginner', 'Expert'.
domainIncludes: TechArticle
rangeIncludes: Text

vehicleIdentificationNumber
type: Property
comment: The Vehicle Identification Number (VIN) is a unique serial number used by the automotive industry to identify individual motor vehicles.
sub property of: serialNumber
contributor: Automotive Ontology Working Group
domainIncludes: Vehicle
rangeIncludes: Text

EUEnergyEfficiencyCategoryC
type: EUEnergyEfficiencyEnumeration
comment: Represents EU Energy Efficiency Class C as defined in EU energy labeling regulations.
isPartOf: pending.schema.org
source: https://github.com/schemaorg/schemaorg/issues/2670

MedicalTest
type: Class
comment: Any medical test, typically performed for diagnostic purposes.
subclass of: MedicalEntity
isPartOf: health-lifesci.schema.org

WearableMeasurementTypeEnumeration
type: Class
comment: Enumerates common types of measurement for wearables products.
subclass of: MeasurementTypeEnumeration
isPartOf: pending.schema.org
source: https://github.com/schemaorg/schemaorg/issues/2811

MisconceptionsHealthAspect
type: HealthAspectEnumeration
comment: Content about common misconceptions and myths that are related to a topic.
isPartOf: pending.schema.org
source: https://github.com/schemaorg/schemaorg/issues/2374

domiciledMortgage
type: Property
comment: Whether borrower is a resident of the jurisdiction where the property is located.
contributor: FIBO
domainIncludes: MortgageLoan
isPartOf: pending.schema.org
rangeIncludes: Boolean
source: https://github.com/schemaorg/schemaorg/issues/1253

PsychologicalTreatment
type: Class
comment: A process of care relying upon counseling, dialogue and communication aimed at improving a mental health condition without use of drugs.
subclass of: TherapeuticProcedure
isPartOf: health-lifesci.schema.org

EUEnergyEfficiencyCategoryE
type: EUEnergyEfficiencyEnumeration
comment: Represents EU Energy Efficiency Class E as defined in EU energy labeling regulations.
isPartOf: pending.schema.org
source: https://github.com/schemaorg/schemaorg/issues/2670

incentiveAmount
type: Property
comment: Describes the amount that can be redeemed from this incentive. QuantitativeValue: Use this for incentives based on price (either raw amount or percentage-based). For a raw amount example, "You can claim $2,500 - $7,500 from the total cost of installation" would be represented as the following: { "@type": "QuantitativeValue", “minValue”: 2500, “maxValue”: 7500, "unitCode": "USD" } QuantitativeValue can also be used for percentage amounts. In such cases, value is used to represent the incentive’s percentage, while maxValue represents a limit (if one exists) to that incentive. The unitCode should be 'P1' and the unitText should be '%', while valueReference should be used for holding the currency type. For example, "You can claim up to 30% of the total cost of installation, up to a maximum of $7,500" would be: { "@type": "QuantitativeValue", "value": 30, "unitCode": "P1", "unitText": "%", “maxValue”: 7500, “valueReference”: “USD” } UnitPriceSpecification: Use this for incentives that are based on amounts rather than price. For example, a net metering rebate that pays $10/kWh, up to $1,000: { "@type": "UnitPriceSpecification", "price": 10, "priceCurrency": "USD", "referenceQuantity": 1, "unitCode": "DO3", "unitText": "kw/h", "maxPrice": 1000, "description": "$10 / kwh up to $1000" } LoanOrCredit: Use for incentives that are loan based. For example, a loan of $4,000 - $50,000 with a repayment term of 10 years, interest free would look like: { "@type": "LoanOrCredit", "loanTerm": { "@type":"QuantitativeValue", "value":"10", "unitCode": "ANN" }, "amount":[ { "@type": "QuantitativeValue", "Name":"fixed interest rate", "value":"0", }, ], "amount":[ { "@type": "MonetaryAmount", "Name":"min loan amount", "value":"4000", "currency":"CAD" }, { "@type": "MonetaryAmount", "Name":"max loan amount", "value":"50000", "currency":"CAD" } ], } In summary: Use QuantitativeValue for absolute/percentage-based incentives applied on the price of a good/service. Use [[UnitP…
domainIncludes: FinancialIncentive
isPartOf: pending.schema.org
rangeIncludes: UnitPriceSpecification
rangeIncludes: QuantitativeValue
rangeIncludes: LoanOrCredit
source: https://github.com/schemaorg/schemaorg/issues/3572

jobImmediateStart
type: Property
comment: An indicator as to whether a position is available for an immediate start.
domainIncludes: JobPosting
isPartOf: pending.schema.org
rangeIncludes: Boolean
source: https://github.com/schemaorg/schemaorg/issues/2244

BookSeries
type: Class
comment: A series of books. Included books can be indicated with the hasPart property.
subclass of: CreativeWorkSeries

BodyMeasurementChest
type: BodyMeasurementTypeEnumeration
comment: Maximum girth of chest. Used, for example, to fit men's suits.
isPartOf: pending.schema.org
source: https://github.com/schemaorg/schemaorg/issues/2811

isPartOfBioChemEntity
type: Property
comment: Indicates a BioChemEntity that is (in some sense) a part of this BioChemEntity.
domainIncludes: BioChemEntity
inverseOf: hasBioChemEntityPart
isPartOf: pending.schema.org
rangeIncludes: BioChemEntity
source: www.bioschemas.org

material
type: Property
comment: A material that something is made from, e.g. leather, wool, cotton, paper.
domainIncludes: CreativeWork
domainIncludes: Product
rangeIncludes: Text
rangeIncludes: Product
rangeIncludes: URL

RsvpResponseYes
type: RsvpResponseType
comment: The invitee will attend.

CertificationInactive
type: CertificationStatusEnumeration
comment: Specifies that a certification is inactive (no longer in effect).
isPartOf: pending.schema.org
source: https://github.com/schemaorg/schemaorg/issues/3230

numAdults
type: Property
comment: The number of adults staying in the unit.
domainIncludes: LodgingReservation
rangeIncludes: Integer
rangeIncludes: QuantitativeValue

URL
type: Class
comment: Data type: URL.
subclass of: Text

providesBroadcastService
type: Property
comment: The BroadcastService offered on this channel.
domainIncludes: BroadcastChannel
inverseOf: hasBroadcastChannel
rangeIncludes: BroadcastService

Recommendation
type: Class
comment: Recommendation is a type of Review that suggests or proposes something as the best option or best course of action. Recommendations may be for products or services, or other concrete things, as in the case of a ranked list or product guide. A Guide may list multiple recommendations for different categories. For example, in a Guide about which TVs to buy, the author may have several Recommendations.
subclass of: Review
isPartOf: pending.schema.org
source: https://github.com/schemaorg/schemaorg/issues/2405

entertainmentBusiness
type: Property
comment: A sub property of location. The entertainment business where the action occurred.
sub property of: location
domainIncludes: PerformAction
rangeIncludes: EntertainmentBusiness

QuantitativeValueDistribution
type: Class
comment: A statistical distribution of values.
subclass of: StructuredValue
source: https://github.com/schemaorg/schemaorg/issues/1698

downvoteCount
type: Property
comment: The number of downvotes this question, answer or comment has received from the community.
domainIncludes: Comment
rangeIncludes: Integer

actionOption
type: Property
comment: A sub property of object. The options subject to this action.
sub property of: object
domainIncludes: ChooseAction
rangeIncludes: Text
rangeIncludes: Thing

PlanAction
type: Class
comment: The act of planning the execution of an event/task/action/reservation/plan to a future date.
subclass of: OrganizeAction

lesserOrEqual
type: Property
comment: This ordering relation for qualitative values indicates that the subject is lesser than or equal to the object.
contributor: GoodRelationsTerms
domainIncludes: QualitativeValue
rangeIncludes: QualitativeValue

RecommendedDoseSchedule
type: Class
comment: A recommended dosing schedule for a drug or supplement as prescribed or recommended by an authority or by the drug/supplement's manufacturer. Capture the recommending authority in the recognizingAuthority property of MedicalEntity.
subclass of: DoseSchedule
isPartOf: health-lifesci.schema.org

renegotiableLoan
type: Property
comment: Whether the terms for payment of interest can be renegotiated during the life of the loan.
contributor: FIBO
domainIncludes: LoanOrCredit
isPartOf: pending.schema.org
rangeIncludes: Boolean
source: https://github.com/schemaorg/schemaorg/issues/1253

pattern
type: Property
equivalent property: printDesignDescription
comment: A pattern that something has, for example 'polka dot', 'striped', 'Canadian flag'. Values are typically expressed as text, although links to controlled value schemes are also supported.
domainIncludes: CreativeWork
domainIncludes: Product
isPartOf: pending.schema.org
rangeIncludes: DefinedTerm
rangeIncludes: Text
source: https://github.com/schemaorg/schemaorg/issues/1797

numberOfPages
type: Property
comment: The number of pages in the book.
domainIncludes: Book
rangeIncludes: Integer

DriveWheelConfigurationValue
type: Class
comment: A value indicating which roadwheels will receive torque.
subclass of: QualitativeValue
contributor: Automotive Ontology Working Group

honorificPrefix
type: Property
comment: An honorific prefix preceding a Person's name such as Dr/Mrs/Mr.
domainIncludes: Person
rangeIncludes: Text

SolveMathAction
type: Class
comment: The action that takes in a math expression and directs users to a page potentially capable of solving/simplifying that expression.
subclass of: Action
isPartOf: pending.schema.org
source: https://github.com/schemaorg/schemaorg/issues/2740

Number
type: Class
type: DataType
comment: Data type: Number.\n\nUsage guidelines:\n\n* Use values from 0123456789 (Unicode 'DIGIT ZERO' (U+0030) to 'DIGIT NINE' (U+0039)) rather than superficially similar Unicode symbols.\n* Use '.' (Unicode 'FULL STOP' (U+002E)) rather than ',' to indicate a decimal point. Avoid using these symbols as a readability separator.

BroadcastEvent
type: Class
comment: An over the air or online broadcast event.
subclass of: PublicationEvent

quarantineGuidelines
type: Property
comment: Guidelines about quarantine rules, e.g. in the context of a pandemic.
domainIncludes: SpecialAnnouncement
isPartOf: pending.schema.org
rangeIncludes: URL
rangeIncludes: WebContent
source: https://github.com/schemaorg/schemaorg/issues/2490

WearableSizeSystemEN13402
type: WearableSizeSystemEnumeration
comment: EN 13402 (joint European standard for size labelling of clothes).
isPartOf: pending.schema.org
source: https://github.com/schemaorg/schemaorg/issues/2811

seasonalOverride
type: Property
comment: Limited period during which these shipping conditions apply.
domainIncludes: ShippingConditions
isPartOf: pending.schema.org
rangeIncludes: OpeningHoursSpecification
source: https://github.com/schemaorg/schemaorg/issues/3617

Observation
type: Class
comment: Instances of the class Observation are used to specify observations about an entity at a particular time. The principal properties of an Observation are observationAbout, measuredProperty, statType, [[value] and observationDate and measuredProperty. Some but not all Observations represent a QuantitativeValue. Quantitative observations can be about a StatisticalVariable, which is an abstract specification about which we can make observations that are grounded at a particular location and time. Observations can also encode a subset of simple RDF-like statements (its observationAbout, a StatisticalVariable, defining the measuredPoperty; its observationAbout property indicating the entity the statement is about, and value ) In the context of a quantitative knowledge graph, typical properties could include measuredProperty, observationAbout, observationDate, value, unitCode, unitText, measurementMethod.
subclass of: QuantitativeValue
subclass of: Intangible
isPartOf: pending.schema.org
source: https://github.com/schemaorg/schemaorg/issues/2291

Notary
type: Class
comment: A notary.
subclass of: LegalService

namedPosition
type: Property
comment: A position played, performed or filled by a person or organization, as part of an organization. For example, an athlete in a SportsTeam might play in the position named 'Quarterback'.
domainIncludes: Role
rangeIncludes: Text
rangeIncludes: URL
supersededBy: roleName

customerRemorseReturnShippingFeesAmount
type: Property
comment: The amount of shipping costs if a product is returned due to customer remorse. Applicable when property customerRemorseReturnFees equals ReturnShippingFees.
domainIncludes: MerchantReturnPolicy
isPartOf: pending.schema.org
rangeIncludes: MonetaryAmount
source: https://github.com/schemaorg/schemaorg/issues/2880

termCode
type: Property
comment: A code that identifies this DefinedTerm within a DefinedTermSet.
domainIncludes: DefinedTerm
isPartOf: pending.schema.org
rangeIncludes: Text
source: https://github.com/schemaorg/schemaorg/issues/894

albumReleaseType
type: Property
comment: The kind of release which this album is: single, EP or album.
contributor: MBZ
domainIncludes: MusicAlbum
rangeIncludes: MusicAlbumReleaseType

MedicalClinic
type: Class
comment: A facility, often associated with a hospital or medical school, that is devoted to the specific diagnosis and/or healthcare. Previously limited to outpatients but with evolution it may be open to inpatients as well.
subclass of: MedicalBusiness
subclass of: MedicalOrganization
isPartOf: health-lifesci.schema.org

AmpStory
type: Class
comment: A creative work with a visual storytelling format intended to be viewed online, particularly on mobile devices.
subclass of: CreativeWork
subclass of: MediaObject
isPartOf: pending.schema.org
source: https://github.com/schemaorg/schemaorg/issues/2646

Vehicle
type: Class
comment: A vehicle is a device that is designed or used to transport people or cargo over land, water, air, or through space.
subclass of: Product

amount
type: Property
comment: The amount of money.
domainIncludes: MonetaryGrant
domainIncludes: DatedMoneySpecification
domainIncludes: InvestmentOrDeposit
domainIncludes: LoanOrCredit
domainIncludes: MoneyTransfer
rangeIncludes: MonetaryAmount
rangeIncludes: Number
source: https://github.com/schemaorg/schemaorg/issues/1698
source: https://github.com/schemaorg/schemaorg/issues/1253

UserPlays
type: Class
comment: UserInteraction and its subtypes is an old way of talking about users interacting with pages. It is generally better to use Action-based vocabulary, alongside types such as Comment.
subclass of: UserInteraction
supersededBy: InteractionCounter

FourWheelDriveConfiguration
type: DriveWheelConfigurationValue
comment: Four-wheel drive is a transmission layout where the engine primarily drives two wheels with a part-time four-wheel drive capability.
contributor: Automotive Ontology Working Group

healthPlanCopay
type: Property
comment: The copay amount.
domainIncludes: HealthPlanCostSharingSpecification
isPartOf: pending.schema.org
rangeIncludes: PriceSpecification
source: https://github.com/schemaorg/schemaorg/issues/1062

discusses
type: Property
comment: Specifies the CreativeWork associated with the UserComment.
domainIncludes: UserComments
rangeIncludes: CreativeWork

editor
type: Property
comment: Specifies the Person who edited the CreativeWork.
domainIncludes: CreativeWork
rangeIncludes: Person

partOfInvoice
type: Property
comment: The order is being paid as part of the referenced Invoice.
sub property of: isReferencedIn
sub property of: isPartOf
domainIncludes: Order
rangeIncludes: Invoice

activityDuration
type: Property
comment: Length of time to engage in the activity.
domainIncludes: ExercisePlan
isPartOf: health-lifesci.schema.org
rangeIncludes: QuantitativeValue
rangeIncludes: Duration

loser
type: Property
comment: A sub property of participant. The loser of the action.
sub property of: participant
domainIncludes: WinAction
rangeIncludes: Person

legislationLegalForce
type: Property
equivalent property: in force
comment: Whether the legislation is currently in force, not in force, or partially in force.
contributor: ELI
domainIncludes: Legislation
isPartOf: pending.schema.org
rangeIncludes: LegalForceStatus
source: eli
source: https://github.com/schemaorg/schemaorg/issues/1156

MerchantReturnFiniteReturnWindow
type: MerchantReturnEnumeration
comment: Specifies that there is a finite window for product returns.
isPartOf: pending.schema.org
source: https://github.com/schemaorg/schemaorg/issues/2288

ItemList
type: Class
comment: A list of items of any sort—for example, Top 10 Movies About Weathermen, or Top 100 Party Songs. Not to be confused with HTML lists, which are often used only for formatting.
subclass of: Intangible

PublicHealth
type: MedicalSpecialty
comment: Branch of medicine that pertains to the health services to improve and protect community health, especially epidemiology, sanitation, immunization, and preventive medicine.
subclass of: MedicalBusiness
isPartOf: health-lifesci.schema.org

HowToTool
type: Class
comment: A tool used (but not consumed) when performing instructions for how to achieve a result.
subclass of: HowToItem

MedicalObservationalStudy
type: Class
comment: An observational study is a type of medical study that attempts to infer the possible effect of a treatment through observation of a cohort of subjects over a period of time. In an observational study, the assignment of subjects into treatment groups versus control groups is outside the control of the investigator. This is in contrast with controlled studies, such as the randomized controlled trials represented by MedicalTrial, where each subject is randomly assigned to a treatment group or a control group before the start of the treatment.
subclass of: MedicalStudy
isPartOf: health-lifesci.schema.org

isbn
type: Property
equivalent property: isbn
comment: The ISBN of the book.
sub property of: identifier
domainIncludes: Book
rangeIncludes: Text

FurnitureStore
type: Class
comment: A furniture store.
subclass of: Store

LegalValueLevel
type: Class
comment: A list of possible levels for the legal validity of a legislation.
subclass of: Enumeration
contributor: ELI
isPartOf: pending.schema.org
source: eli
source: https://github.com/schemaorg/schemaorg/issues/1156

GettingAccessHealthAspect
type: HealthAspectEnumeration
comment: Content that discusses practical and policy aspects for getting access to specific kinds of healthcare (e.g. distribution mechanisms for vaccines).
isPartOf: pending.schema.org
source: https://github.com/schemaorg/schemaorg/issues/2799

NGO
type: Class
equivalent class: NonGovernmentalOrganization
comment: Organization: Non-governmental Organization.
subclass of: Organization

calories
type: Property
comment: The number of calories.
domainIncludes: NutritionInformation
rangeIncludes: Energy

athlete
type: Property
comment: A person that acts as performing member of a sports team; a player as opposed to a coach.
domainIncludes: SportsTeam
rangeIncludes: Person

geoRadius
type: Property
comment: Indicates the approximate radius of a GeoCircle (metres unless indicated otherwise via Distance notation).
domainIncludes: GeoCircle
rangeIncludes: Text
rangeIncludes: Number
rangeIncludes: Distance

overdosage
type: Property
comment: Any information related to overdose on a drug, including signs or symptoms, treatments, contact information for emergency response.
domainIncludes: Drug
isPartOf: health-lifesci.schema.org
rangeIncludes: Text

replacer
type: Property
comment: A sub property of object. The object that replaces.
sub property of: object
domainIncludes: ReplaceAction
rangeIncludes: Thing

loanMortgageMandateAmount
type: Property
comment: Amount of mortgage mandate that can be converted into a proper mortgage at a later stage.
contributor: FIBO
domainIncludes: MortgageLoan
isPartOf: pending.schema.org
rangeIncludes: MonetaryAmount
source: https://github.com/schemaorg/schemaorg/issues/1253

spokenByCharacter
type: Property
comment: The (e.g. fictional) character, Person or Organization to whom the quotation is attributed within the containing CreativeWork.
domainIncludes: Quotation
isPartOf: pending.schema.org
rangeIncludes: Organization
rangeIncludes: Person
source: https://github.com/schemaorg/schemaorg/issues/271

ReservationHold
type: ReservationStatusType
comment: The status of a reservation on hold pending an update like credit card number or flight changes.

thumbnail
type: Property
comment: Thumbnail image for an image or video.
domainIncludes: CreativeWork
rangeIncludes: ImageObject

SelfStorage
type: Class
comment: A self-storage facility.
subclass of: LocalBusiness

workTranslation
type: Property
comment: A work that is a translation of the content of this work. E.g. 西遊記 has an English workTranslation “Journey to the West”, a German workTranslation “Monkeys Pilgerfahrt” and a Vietnamese translation Tây du ký bình khảo.
domainIncludes: CreativeWork
inverseOf: translationOfWork
isPartOf: bib.schema.org
rangeIncludes: CreativeWork

DistanceFee
type: PriceComponentTypeEnumeration
comment: Represents the distance fee (e.g., price per km or mile) part of the total price for an offered product, for example a car rental.
isPartOf: pending.schema.org
source: https://github.com/schemaorg/schemaorg/issues/2689

GovernmentService
type: Class
comment: A service provided by a government organization, e.g. food stamps, veterans benefits, etc.
subclass of: Service

cvdCollectionDate
type: Property
comment: collectiondate - Date for which patient counts are reported.
domainIncludes: CDCPMDRecord
isPartOf: pending.schema.org
rangeIncludes: Text
rangeIncludes: DateTime
source: https://github.com/schemaorg/schemaorg/issues/2521

BodyMeasurementWeight
type: BodyMeasurementTypeEnumeration
comment: Body weight. Used, for example, to measure pantyhose.
isPartOf: pending.schema.org
source: https://github.com/schemaorg/schemaorg/issues/2811

ReceiveAction
type: Class
comment: The act of physically/electronically taking delivery of an object that has been transferred from an origin to a destination. Reciprocal of SendAction.\n\nRelated actions:\n\n* SendAction: The reciprocal of ReceiveAction.\n* TakeAction: Unlike TakeAction, ReceiveAction does not imply that the ownership has been transferred (e.g. I can receive a package, but it does not mean the package is now mine).
subclass of: TransferAction

VegetarianDiet
type: RestrictedDiet
comment: A diet exclusive of animal meat.

FlightReservation
type: Class
comment: A reservation for air travel.\n\nNote: This type is for information about actual reservations, e.g. in confirmation emails or HTML pages with individual confirmations of reservations. For offers of tickets, use Offer.
subclass of: Reservation

priceType
type: Property
equivalent property: PriceTypeCode
comment: Defines the type of a price specified for an offered product, for example a list price, a (temporary) sale price or a manufacturer suggested retail price. If multiple prices are specified for an offer the priceType property can be used to identify the type of each such specified price. The value of priceType can be specified as a value from enumeration PriceTypeEnumeration or, a UN/EDIFACT 5387 code, or as a free form text string for price types that are not already predefined in PriceTypeEnumeration.
sub property of: isClassifiedBy
contributor: GoodRelationsTerms
domainIncludes: CompoundPriceSpecification
domainIncludes: UnitPriceSpecification
rangeIncludes: Text
rangeIncludes: PriceTypeEnumeration

encodings
type: Property
comment: A media object that encodes this CreativeWork.
domainIncludes: CreativeWork
rangeIncludes: MediaObject
supersededBy: encoding

CourseInstance
type: Class
comment: An instance of a Course which is distinct from other instances because it is offered at a different time or location or through different media or modes of study or to a specific section of students.
subclass of: Event

BodyMeasurementHeight
type: BodyMeasurementTypeEnumeration
comment: Body height (measured between crown of head and soles of feet). Used, for example, to fit jackets.
isPartOf: pending.schema.org
source: https://github.com/schemaorg/schemaorg/issues/2811

MedicalEvidenceLevel
type: Class
comment: Level of evidence for a medical guideline. Enumerated type.
subclass of: MedicalEnumeration
isPartOf: health-lifesci.schema.org

OfferCatalog
type: Class
comment: An OfferCatalog is an ItemList that contains related Offers and/or further OfferCatalogs that are offeredBy the same provider.
subclass of: ItemList

TouristDestination
type: Class
comment: A tourist destination. In principle any Place can be a TouristDestination from a City, Region or Country to an AmusementPark or Hotel. This Type can be used on its own to describe a general TouristDestination, or be used as an additionalType to add tourist relevant properties to any other Place. A TouristDestination is defined as a Place that contains, or is colocated with, one or more TouristAttractions, often linked by a similar theme or interest to a particular touristType. The [UNWTO](http://www2.unwto.org/) defines Destination (main destination of a tourism trip) as the place visited that is central to the decision to take the trip. (See examples below.)
subclass of: Place
contributor: IIT-CNR.it
contributor: Tourism
isPartOf: pending.schema.org
source: https://github.com/schemaorg/schemaorg/issues/1810

subEvents
type: Property
comment: Events that are a part of this event. For example, a conference event includes many presentations, each subEvents of the conference.
domainIncludes: Event
rangeIncludes: Event
supersededBy: subEvent

gtin
type: Property
equivalent property: gtin
equivalent property: gTINId
comment: A Global Trade Item Number ([GTIN](https://www.gs1.org/standards/id-keys/gtin)). GTINs identify trade items, including products and services, using numeric identification codes. A correct gtin value should be a valid GTIN, which means that it should be an all-numeric string of either 8, 12, 13 or 14 digits, or a "GS1 Digital Link" URL based on such a string. The numeric component should also have a [valid GS1 check digit](https://www.gs1.org/services/check-digit-calculator) and meet the other rules for valid GTINs. See also [GS1's GTIN Summary](http://www.gs1.org/barcodes/technical/idkeys/gtin) and [Wikipedia](https://en.wikipedia.org/wiki/Global_Trade_Item_Number) for more details. Left-padding of the gtin values is not required or encouraged. The gtin property generalizes the earlier gtin8, gtin12, gtin13, and gtin14 properties. The GS1 [digital link specifications](https://www.gs1.org/standards/Digital-Link/) expresses GTINs as URLs (URIs, IRIs, etc.). Digital Links should be populated into the hasGS1DigitalLink attribute. Note also that this is a definition for how to include GTINs in Schema.org data, and not a definition of GTINs in general - see the GS1 documentation for authoritative details.
sub property of: identifier
domainIncludes: Offer
domainIncludes: Demand
domainIncludes: Product
isPartOf: pending.schema.org
rangeIncludes: Text
rangeIncludes: URL
source: https://github.com/schemaorg/schemaorg/issues/2288

inCodeSet
type: Property
comment: A CategoryCodeSet that contains this category code.
sub property of: inDefinedTermSet
domainIncludes: CategoryCode
isPartOf: pending.schema.org
rangeIncludes: URL
rangeIncludes: CategoryCodeSet
source: https://github.com/schemaorg/schemaorg/issues/894

ActiveNotRecruiting
type: MedicalStudyStatus
comment: Active, but not recruiting new participants.
isPartOf: health-lifesci.schema.org

userInteractionCount
type: Property
comment: The number of interactions for the CreativeWork using the WebSite or SoftwareApplication.
domainIncludes: InteractionCounter
rangeIncludes: Integer

possibleTreatment
type: Property
comment: A possible treatment to address this condition, sign or symptom.
domainIncludes: MedicalSignOrSymptom
domainIncludes: MedicalCondition
isPartOf: health-lifesci.schema.org
rangeIncludes: MedicalTherapy
rangeIncludes: Drug
rangeIncludes: LifestyleModification
rangeIncludes: DrugClass

EnergyStarEnergyEfficiencyEnumeration
type: Class
comment: Used to indicate whether a product is EnergyStar certified.
subclass of: EnergyEfficiencyEnumeration
isPartOf: pending.schema.org
source: https://github.com/schemaorg/schemaorg/issues/2670

industry
type: Property
comment: The industry associated with the job position.
domainIncludes: JobPosting
rangeIncludes: DefinedTerm
rangeIncludes: Text

CaseSeries
type: MedicalObservationalStudyDesign
comment: A case series (also known as a clinical series) is a medical research study that tracks patients with a known exposure given similar treatment or examines their medical records for exposure and outcome. A case series can be retrospective or prospective and usually involves a smaller number of patients than the more powerful case-control studies or randomized controlled trials. Case series may be consecutive or non-consecutive, depending on whether all cases presenting to the reporting authors over a period of time were included, or only a selection.
isPartOf: health-lifesci.schema.org

Artery
type: Class
equivalent class: http://purl.bioontology.org/ontology/SNOMEDCT/51114001
comment: A type of blood vessel that specifically carries blood away from the heart.
subclass of: Vessel
isPartOf: health-lifesci.schema.org

experienceRequirements
type: Property
comment: Description of skills and experience needed for the position or Occupation.
domainIncludes: JobPosting
domainIncludes: Occupation
rangeIncludes: Text
rangeIncludes: OccupationalExperienceRequirements
source: https://github.com/schemaorg/schemaorg/issues/1698

workload
type: Property
comment: Quantitative measure of the physiologic output of the exercise; also referred to as energy expenditure.
domainIncludes: ExercisePlan
isPartOf: health-lifesci.schema.org
rangeIncludes: Energy
rangeIncludes: QuantitativeValue

AudiobookFormat
type: BookFormatType
comment: Book format: Audiobook. This is an enumerated value for use with the bookFormat property. There is also a type 'Audiobook' in the bib extension which includes Audiobook specific properties.

codeRepository
type: Property
comment: Link to the repository where the un-compiled, human readable code and related code is located (SVN, GitHub, CodePlex).
domainIncludes: SoftwareSourceCode
rangeIncludes: URL

encoding
type: Property
comment: A media object that encodes this CreativeWork. This property is a synonym for associatedMedia.
domainIncludes: CreativeWork
inverseOf: encodesCreativeWork
rangeIncludes: MediaObject

PaymentChargeSpecification
type: Class
comment: The costs of settling the payment using a particular payment method.
subclass of: PriceSpecification
contributor: good-relations-and-schema-org

MusicAlbumReleaseType
type: Class
comment: The kind of release which this album is: single, EP or album.
subclass of: Enumeration
contributor: MBZ

CableOrSatelliteService
type: Class
comment: A service which provides access to media programming like TV or radio. Access may be via cable or satellite.
subclass of: Service

MedicalIntangible
type: Class
comment: A utility class that serves as the umbrella for a number of 'intangible' things in the medical space.
subclass of: MedicalEntity
isPartOf: health-lifesci.schema.org

acceptsReservations
type: Property
comment: Indicates whether a FoodEstablishment accepts reservations. Values can be Boolean, an URL at which reservations can be made or (for backwards compatibility) the strings ```Yes``` or ```No```.
domainIncludes: FoodEstablishment
rangeIncludes: URL
rangeIncludes: Boolean
rangeIncludes: Text

Skin
type: PhysicalExam
comment: Skin assessment with clinical examination.
isPartOf: health-lifesci.schema.org

membershipNumber
type: Property
comment: A unique identifier for the membership.
domainIncludes: ProgramMembership
rangeIncludes: Text

PaymentService
type: Class
equivalent class: PaymentService
comment: A Service to transfer funds from a person or organization to a beneficiary person or organization.
subclass of: PaymentMethod
subclass of: FinancialProduct
contributor: FIBO

returnLabelSource
type: Property
comment: The method (from an enumeration) by which the customer obtains a return shipping label for a product returned for any reason.
domainIncludes: MerchantReturnPolicy
isPartOf: pending.schema.org
rangeIncludes: ReturnLabelSourceEnumeration
source: https://github.com/schemaorg/schemaorg/issues/2880

CompositeWithTrainedAlgorithmicMediaDigitalSource
type: IPTCDigitalSourceEnumeration
comment: Content coded as 'composite with trained algorithmic media' using the IPTC digital source type vocabulary.
isPartOf: pending.schema.org
source: https://github.com/schemaorg/schemaorg/issues/3392

CheckAction
type: Class
comment: An agent inspects, determines, investigates, inquires, or examines an object's accuracy, quality, condition, or state.
subclass of: FindAction

RealEstateListing
type: Class
comment: A RealEstateListing is a listing that describes one or more real-estate Offers (whose businessFunction is typically to lease out, or to sell). The RealEstateListing type itself represents the overall listing, as manifested in some WebPage.
subclass of: WebPage
isPartOf: pending.schema.org
source: https://github.com/schemaorg/schemaorg/issues/2348

accessibilityHazard
type: Property
comment: A characteristic of the described resource that is physiologically dangerous to some users. Related to WCAG 2.0 guideline 2.3. Values should be drawn from the [approved vocabulary](https://www.w3.org/2021/a11y-discov-vocab/latest/#accessibilityHazard-vocabulary).
domainIncludes: CreativeWork
rangeIncludes: Text

InteractionCounter
type: Class
comment: A summary of how users have interacted with this CreativeWork. In most cases, authors will use a subtype to specify the specific type of interaction.
subclass of: StructuredValue

softwareAddOn
type: Property
comment: Additional content for a software application.
domainIncludes: SoftwareApplication
rangeIncludes: SoftwareApplication

itemLocation
type: Property
comment: Current location of the item.
sub property of: location
domainIncludes: ArchiveComponent
isPartOf: pending.schema.org
rangeIncludes: Text
rangeIncludes: PostalAddress
rangeIncludes: Place
source: https://github.com/schemaorg/schemaorg/issues/1758

colorSwatch
type: Property
comment: A color swatch image, visualizing the color of a Product. Should match the textual description specified in the color property. This can be a URL or a fully described ImageObject.
sub property of: image
domainIncludes: Product
isPartOf: pending.schema.org
rangeIncludes: URL
rangeIncludes: ImageObject
source: https://github.com/schemaorg/schemaorg/issues/3423

repeatCount
type: Property
comment: Defines the number of times a recurring Event will take place.
domainIncludes: Schedule
isPartOf: pending.schema.org
rangeIncludes: Integer
source: https://github.com/schemaorg/schemaorg/issues/1457

sourceOrganization
type: Property
comment: The Organization on whose behalf the creator was working.
domainIncludes: CreativeWork
rangeIncludes: Organization

worksFor
type: Property
comment: Organizations that the person works for.
domainIncludes: Person
rangeIncludes: Organization

transcript
type: Property
comment: If this MediaObject is an AudioObject or VideoObject, the transcript of that object.
domainIncludes: AudioObject
domainIncludes: VideoObject
rangeIncludes: Text

BoardingPolicyType
type: Class
comment: A type of boarding policy used by an airline.
subclass of: Enumeration

Completed
type: MedicalStudyStatus
comment: Completed.
isPartOf: health-lifesci.schema.org

inProductGroupWithID
type: Property
equivalent property: variantId
comment: Indicates the productGroupID for a ProductGroup that this product isVariantOf.
domainIncludes: Product
isPartOf: pending.schema.org
rangeIncludes: Text
source: https://github.com/schemaorg/schemaorg/issues/1797

WearableSizeSystemContinental
type: WearableSizeSystemEnumeration
comment: Continental size system for wearables.
isPartOf: pending.schema.org
source: https://github.com/schemaorg/schemaorg/issues/2811

OnSitePickup
type: DeliveryMethod
comment: A DeliveryMethod in which an item is collected on site, e.g. in a store or at a box office.

AssessAction
type: Class
comment: The act of forming one's opinion, reaction or sentiment.
subclass of: Action

WearableMeasurementWaist
type: WearableMeasurementTypeEnumeration
comment: Measurement of the waist section, for example of pants.
isPartOf: pending.schema.org
source: https://github.com/schemaorg/schemaorg/issues/2811

steps
type: Property
comment: A single step item (as HowToStep, text, document, video, etc.) or a HowToSection (originally misnamed 'steps'; 'step' is preferred).
domainIncludes: HowToSection
domainIncludes: HowTo
rangeIncludes: CreativeWork
rangeIncludes: ItemList
rangeIncludes: Text
supersededBy: step

legislationResponsible
type: Property
equivalent property: responsibility of
comment: An individual or organization that has some kind of responsibility for the legislation. Typically the ministry who is/was in charge of elaborating the legislation, or the adressee for potential questions about the legislation once it is published.
contributor: ELI
domainIncludes: Legislation
isPartOf: pending.schema.org
rangeIncludes: Organization
rangeIncludes: Person
source: https://github.com/schemaorg/schemaorg/issues/1156
source: eli

identifyingExam
type: Property
comment: A physical examination that can identify this sign.
domainIncludes: MedicalSign
isPartOf: health-lifesci.schema.org
rangeIncludes: PhysicalExam

Suspended
type: MedicalStudyStatus
comment: Suspended.
isPartOf: health-lifesci.schema.org

proteinContent
type: Property
comment: The number of grams of protein.
domainIncludes: NutritionInformation
rangeIncludes: Mass

DepositAccount
type: Class
comment: A type of Bank Account with a main purpose of depositing funds to gain interest or other benefits.
subclass of: InvestmentOrDeposit
subclass of: BankAccount
contributor: FIBO

children
type: Property
comment: A child of the person.
domainIncludes: Person
rangeIncludes: Person

artworkSurface
type: Property
comment: The supporting materials for the artwork, e.g. Canvas, Paper, Wood, Board, etc.
domainIncludes: VisualArtwork
rangeIncludes: Text
rangeIncludes: URL

Musculoskeletal
type: MedicalSpecialty
comment: A specific branch of medical science that pertains to diagnosis and treatment of disorders of muscles, ligaments and skeletal system.
isPartOf: health-lifesci.schema.org

variableMeasured
type: Property
comment: The variableMeasured property can indicate (repeated as necessary) the variables that are measured in some dataset, either described as text or as pairs of identifier and description using PropertyValue, or more explicitly as a StatisticalVariable.
domainIncludes: Observation
domainIncludes: Dataset
isPartOf: pending.schema.org
rangeIncludes: PropertyValue
rangeIncludes: Property
rangeIncludes: Text
rangeIncludes: StatisticalVariable
source: https://github.com/schemaorg/schemaorg/issues/1083

occupationalCategory
type: Property
comment: A category describing the job, preferably using a term from a taxonomy such as [BLS O*NET-SOC](http://www.onetcenter.org/taxonomy.html), [ISCO-08](https://www.ilo.org/public/english/bureau/stat/isco/isco08/) or similar, with the property repeated for each applicable value. Ideally the taxonomy should be identified, and both the textual label and formal code for the category should be provided.\n Note: for historical reasons, any textual label and formal code provided as a literal may be assumed to be from O*NET-SOC.
domainIncludes: WorkBasedProgram
domainIncludes: Occupation
domainIncludes: Physician
domainIncludes: JobPosting
domainIncludes: EducationalOccupationalProgram
isPartOf: pending.schema.org
rangeIncludes: CategoryCode
rangeIncludes: Text
source: https://github.com/schemaorg/schemaorg/issues/2289
source: https://github.com/schemaorg/schemaorg/issues/2460
source: https://github.com/schemaorg/schemaorg/issues/3420
source: https://github.com/schemaorg/schemaorg/issues/2192
source: https://github.com/schemaorg/schemaorg/issues/1698

pregnancyWarning
type: Property
comment: Any precaution, guidance, contraindication, etc. related to this drug's use during pregnancy.
domainIncludes: Drug
isPartOf: health-lifesci.schema.org
rangeIncludes: Text

signOrSymptom
type: Property
comment: A sign or symptom of this condition. Signs are objective or physically observable manifestations of the medical condition while symptoms are the subjective experience of the medical condition.
domainIncludes: MedicalCondition
isPartOf: health-lifesci.schema.org
rangeIncludes: MedicalSignOrSymptom

ReactAction
type: Class
comment: The act of responding instinctively and emotionally to an object, expressing a sentiment.
subclass of: AssessAction

AmusementPark
type: Class
comment: An amusement park.
subclass of: EntertainmentBusiness

diseaseSpreadStatistics
type: Property
comment: Statistical information about the spread of a disease, either as WebContent, or described directly as a Dataset, or the specific Observations in the dataset. When a WebContent URL is provided, the page indicated might also contain more such markup.
domainIncludes: SpecialAnnouncement
isPartOf: pending.schema.org
rangeIncludes: Dataset
rangeIncludes: Observation
rangeIncludes: URL
rangeIncludes: WebContent
source: https://github.com/schemaorg/schemaorg/issues/2490

area
type: Property
comment: The area within which users can expect to reach the broadcast service.
domainIncludes: BroadcastService
rangeIncludes: Place
supersededBy: serviceArea

hasCourse
type: Property
comment: A course or class that is one of the learning opportunities that constitute an educational / occupational program. No information is implied about whether the course is mandatory or optional; no guarantee is implied about whether the course will be available to everyone on the program.
domainIncludes: EducationalOccupationalProgram
isPartOf: pending.schema.org
rangeIncludes: Course
source: https://github.com/schemaorg/schemaorg/issues/2483

Report
type: Class
comment: A Report generated by governmental or non-governmental organization.
subclass of: Article

merchant
type: Property
comment: 'merchant' is an out-dated term for 'seller'.
domainIncludes: Order
rangeIncludes: Organization
rangeIncludes: Person
supersededBy: seller

availableIn
type: Property
comment: The location in which the strength is available.
domainIncludes: DrugStrength
isPartOf: health-lifesci.schema.org
rangeIncludes: AdministrativeArea

Rheumatologic
type: MedicalSpecialty
comment: A specific branch of medical science that deals with the study and treatment of rheumatic, autoimmune or joint diseases.
isPartOf: health-lifesci.schema.org

ComputerStore
type: Class
comment: A computer store.
subclass of: Store

WinAction
type: Class
comment: The act of achieving victory in a competitive activity.
subclass of: AchieveAction

countryOfAssembly
type: Property
equivalent property: finalAssemblyCountry
comment: The place where the product was assembled.
domainIncludes: Product
isPartOf: pending.schema.org
rangeIncludes: Text
source: https://github.com/schemaorg/schemaorg/issues/991

TierBenefitLoyaltyPoints
type: TierBenefitEnumeration
comment: Benefit of the tier is earning of loyalty points.
isPartOf: pending.schema.org
source: https://github.com/schemaorg/schemaorg/issues/3563

SportsOrganization
type: Class
comment: Represents the collection of all sports organizations, including sports teams, governing bodies, and sports associations.
subclass of: Organization

reviewCount
type: Property
comment: The count of total number of reviews.
domainIncludes: AggregateRating
rangeIncludes: Integer

ItemListOrderType
type: Class
comment: Enumerated for values for itemListOrder for indicating how an ordered ItemList is organized.
subclass of: Enumeration

geographicArea
type: Property
comment: The geographic area associated with the audience.
domainIncludes: Audience
rangeIncludes: AdministrativeArea

FireStation
type: Class
comment: A fire station. With firemen.
subclass of: CivicStructure
subclass of: EmergencyService

dateIssued
type: Property
comment: The date the ticket was issued.
domainIncludes: Ticket
rangeIncludes: Date
rangeIncludes: DateTime

hasCategoryCode
type: Property
comment: A Category code contained in this code set.
sub property of: hasDefinedTerm
domainIncludes: CategoryCodeSet
isPartOf: pending.schema.org
rangeIncludes: CategoryCode
source: https://github.com/schemaorg/schemaorg/issues/894

requiresSubscription
type: Property
comment: Indicates if use of the media require a subscription (either paid or free). Allowed values are ```true``` or ```false``` (note that an earlier version had 'yes', 'no').
domainIncludes: ActionAccessSpecification
domainIncludes: MediaObject
rangeIncludes: MediaSubscription
rangeIncludes: Boolean
source: https://github.com/schemaorg/schemaorg/issues/1741

nonEqual
type: Property
comment: This ordering relation for qualitative values indicates that the subject is not equal to the object.
contributor: GoodRelationsTerms
domainIncludes: QualitativeValue
rangeIncludes: QualitativeValue

sdLicense
type: Property
comment: A license document that applies to this structured data, typically indicated by URL.
domainIncludes: CreativeWork
isPartOf: pending.schema.org
rangeIncludes: URL
rangeIncludes: CreativeWork
source: https://github.com/schemaorg/schemaorg/issues/1886

MedicalRiskCalculator
type: Class
comment: A complex mathematical calculation requiring an online calculator, used to assess prognosis. Note: use the url property of Thing to record any URLs for online calculators.
subclass of: MedicalRiskEstimator
isPartOf: health-lifesci.schema.org

MedicalRiskScore
type: Class
comment: A simple system that adds up the number of risk factors to yield a score that is associated with prognosis, e.g. CHAD score, TIMI risk score.
subclass of: MedicalRiskEstimator
isPartOf: health-lifesci.schema.org

EventScheduled
type: EventStatusType
comment: The event is taking place or has taken place on the startDate as scheduled. Use of this value is optional, as it is assumed by default.

DislikeAction
type: Class
comment: The act of expressing a negative sentiment about the object. An agent dislikes an object (a proposition, topic or theme) with participants.
subclass of: ReactAction

MoneyTransfer
type: Class
comment: The act of transferring money from one place to another place. This may occur electronically or physically.
subclass of: TransferAction
contributor: FIBO
isPartOf: pending.schema.org
source: https://github.com/schemaorg/schemaorg/issues/1253

ChildCare
type: Class
comment: A Childcare center.
subclass of: LocalBusiness

browserRequirements
type: Property
comment: Specifies browser requirements in human-readable text. For example, 'requires HTML5 support'.
domainIncludes: WebApplication
rangeIncludes: Text

PaymentCard
type: Class
equivalent class: FinancialCard
comment: A payment method using a credit, debit, store or other card to associate the payment with an account.
subclass of: PaymentMethod
subclass of: FinancialProduct
contributor: FIBO

usageInfo
type: Property
comment: The schema.org usageInfo property indicates further information about a CreativeWork. This property is applicable both to works that are freely available and to those that require payment or other transactions. It can reference additional information, e.g. community expectations on preferred linking and citation conventions, as well as purchasing details. For something that can be commercially licensed, usageInfo can provide detailed, resource-specific information about licensing options. This property can be used alongside the license property which indicates license(s) applicable to some piece of content. The usageInfo property can provide information about other licensing options, e.g. acquiring commercial usage rights for an image that is also available under non-commercial creative commons licenses.
domainIncludes: CreativeWork
isPartOf: pending.schema.org
rangeIncludes: CreativeWork
rangeIncludes: URL
source: https://github.com/schemaorg/schemaorg/issues/2454

OrderItem
type: Class
equivalent class: LineTradeAgreement
comment: An order item is a line of an order. It includes the quantity and shipping details of a bought offer.
subclass of: StructuredValue

QAPage
type: Class
comment: A QAPage is a WebPage focussed on a specific Question and its Answer(s), e.g. in a question answering site or documenting Frequently Asked Questions (FAQs).
subclass of: WebPage

contactType
type: Property
equivalent property: contactType
comment: A person or organization can have different contact points, for different purposes. For example, a sales contact point, a PR contact point and so on. This property is used to specify the kind of contact point.
domainIncludes: ContactPoint
rangeIncludes: Text

diagram
type: Property
comment: An image containing a diagram that illustrates the structure and/or its component substructures and/or connections with other structures.
domainIncludes: AnatomicalStructure
isPartOf: health-lifesci.schema.org
rangeIncludes: ImageObject

processingTime
type: Property
comment: Estimated processing time for the service using this channel.
domainIncludes: ServiceChannel
rangeIncludes: Duration

ReturnLabelSourceEnumeration
type: Class
comment: Enumerates several types of return labels for product returns.
subclass of: Enumeration
isPartOf: pending.schema.org
source: https://github.com/schemaorg/schemaorg/issues/2880

InteractAction
type: Class
comment: The act of interacting with another person or organization.
subclass of: Action

TVSeries
type: Class
comment: CreativeWorkSeries dedicated to TV broadcast and associated online delivery.
subclass of: CreativeWorkSeries
subclass of: CreativeWork

Ticket
type: Class
comment: Used to describe a ticket to an event, a flight, a bus ride, etc.
subclass of: Intangible

significantLinks
type: Property
comment: The most significant URLs on the page. Typically, these are the non-navigation links that are clicked on the most.
domainIncludes: WebPage
rangeIncludes: URL
supersededBy: significantLink

inverseOf
type: Property
comment: Relates a property to a property that is its inverse. Inverse properties relate the same pairs of items to each other, but in reversed direction. For example, the 'alumni' and 'alumniOf' properties are inverseOf each other. Some properties don't have explicit inverses; in these situations RDFa and JSON-LD syntax for reverse properties can be used.
domainIncludes: Property
isPartOf: meta.schema.org
rangeIncludes: Property

associatedMediaReview
type: Property
comment: An associated MediaReview, related by specific common content, topic or claim. The expectation is that this property would be most typically used in cases where a single activity is conducting both claim reviews and media reviews, in which case relatedMediaReview would commonly be used on a ClaimReview, while associatedClaimReview would be used on MediaReview.
sub property of: associatedReview
domainIncludes: Review
isPartOf: pending.schema.org
rangeIncludes: Review
source: https://github.com/schemaorg/schemaorg/issues/2450

departureBoatTerminal
type: Property
comment: The terminal or port from which the boat departs.
domainIncludes: BoatTrip
isPartOf: pending.schema.org
rangeIncludes: BoatTerminal
source: https://github.com/schemaorg/schemaorg/issues/1755

BodyMeasurementUnderbust
type: BodyMeasurementTypeEnumeration
comment: Girth of body just below the bust. Used, for example, to fit women's swimwear.
isPartOf: pending.schema.org
source: https://github.com/schemaorg/schemaorg/issues/2811

XRay
type: MedicalImagingTechnique
comment: X-ray imaging.
isPartOf: health-lifesci.schema.org

brand
type: Property
equivalent property: brandName
comment: The brand(s) associated with a product or service, or the brand(s) maintained by an organization or business person.
sub property of: hasDesignation
domainIncludes: Organization
domainIncludes: Person
domainIncludes: Product
domainIncludes: Service
rangeIncludes: Organization
rangeIncludes: Brand

Dataset
type: Class
equivalent class: Dataset
comment: A body of structured information describing some topic(s) of interest.
subclass of: CreativeWork
contributor: DatasetClass

study
type: Property
comment: A medical study or trial related to this entity.
domainIncludes: MedicalEntity
isPartOf: health-lifesci.schema.org
rangeIncludes: MedicalStudy

suggestedAge
type: Property
comment: The age or age range for the intended audience or person, for example 3-12 months for infants, 1-5 years for toddlers.
domainIncludes: PeopleAudience
domainIncludes: SizeSpecification
isPartOf: pending.schema.org
rangeIncludes: QuantitativeValue
source: https://github.com/schemaorg/schemaorg/issues/2811

checkoutTime
type: Property
comment: The latest someone may check out of a lodging establishment.
domainIncludes: LodgingReservation
domainIncludes: LodgingBusiness
rangeIncludes: DateTime
rangeIncludes: Time

Florist
type: Class
comment: A florist.
subclass of: Store

duration
type: Property
comment: The duration of the item (movie, audio recording, event, etc.) in [ISO 8601 duration format](http://en.wikipedia.org/wiki/ISO_8601).
domainIncludes: MediaObject
domainIncludes: MusicRelease
domainIncludes: Audiobook
domainIncludes: Episode
domainIncludes: Movie
domainIncludes: QuantitativeValueDistribution
domainIncludes: Schedule
domainIncludes: MusicRecording
domainIncludes: ServicePeriod
domainIncludes: Event
rangeIncludes: Duration
rangeIncludes: QuantitativeValue
source: https://github.com/schemaorg/schemaorg/issues/1698
source: https://github.com/schemaorg/schemaorg/issues/3617
source: https://github.com/schemaorg/schemaorg/issues/1457

differentialDiagnosis
type: Property
comment: One of a set of differential diagnoses for the condition. Specifically, a closely-related or competing diagnosis typically considered later in the cognitive process whereby this medical condition is distinguished from others most likely responsible for a similar collection of signs and symptoms to reach the most parsimonious diagnosis or diagnoses in a patient.
domainIncludes: MedicalCondition
isPartOf: health-lifesci.schema.org
rangeIncludes: DDxElement

MovingCompany
type: Class
comment: A moving company.
subclass of: HomeAndConstructionBusiness

ITSportCompanyCharity
type: ITNonprofitType
comment: ITSportCompanyCharity: Non-profit type referring to Companies that organize sports activities for the public or inscribed members (Ital. Società Sportiva Dilettantistica or SSD) according to Italian Law 289 of 2002.
isPartOf: pending.schema.org
source: https://github.com/schemaorg/schemaorg/issues/3629

Longitudinal
type: MedicalObservationalStudyDesign
comment: Unlike cross-sectional studies, longitudinal studies track the same people, and therefore the differences observed in those people are less likely to be the result of cultural differences across generations. Longitudinal studies are also used in medicine to uncover predictors of certain diseases.
isPartOf: health-lifesci.schema.org

Museum
type: Class
comment: A museum.
subclass of: CivicStructure

Eye
type: PhysicalExam
comment: Eye or ophthalmological function assessment with clinical examination.
isPartOf: health-lifesci.schema.org

Resort
type: Class
comment: A resort is a place used for relaxation or recreation, attracting visitors for holidays or vacations. Resorts are places, towns or sometimes commercial establishments operated by a single company (source: Wikipedia, the free encyclopedia, see http://en.wikipedia.org/wiki/Resort). See also the dedicated document on the use of schema.org for marking up hotels and other forms of accommodations.
subclass of: LodgingBusiness
contributor: STI Accommodation Ontology

award
type: Property
comment: An award won by or for this item.
domainIncludes: Organization
domainIncludes: Person
domainIncludes: Service
domainIncludes: CreativeWork
domainIncludes: Product
rangeIncludes: Text

dateReceived
type: Property
comment: The date/time the message was received if a single recipient exists.
domainIncludes: Message
rangeIncludes: DateTime

MulticellularParasite
type: InfectiousAgentClass
comment: Multicellular parasite that causes an infection.
isPartOf: health-lifesci.schema.org

reservationStatus
type: Property
comment: The current status of the reservation.
domainIncludes: Reservation
rangeIncludes: ReservationStatusType

Cash
type: PaymentMethodType
comment: Payment using cash, on premises, equivalent to http://purl.org/goodrelations/v1#Cash.

reservationFor
type: Property
comment: The thing -- flight, event, restaurant, etc. being reserved.
domainIncludes: Reservation
rangeIncludes: Thing

WebSite
type: Class
comment: A WebSite is a set of related web pages and other items typically served from a single web domain and accessible via URLs.
subclass of: CreativeWork

InForce
type: LegalForceStatus
comment: Indicates that a legislation is in force.
contributor: ELI
isPartOf: pending.schema.org
source: https://github.com/schemaorg/schemaorg/issues/1156
source: eli

qualifiedExpense
type: Property
comment: Optional. The types of expenses that are covered by the incentive. For example some incentives are only for the goods (tangible items) but the services (labor) are excluded.
domainIncludes: FinancialIncentive
isPartOf: pending.schema.org
rangeIncludes: IncentiveQualifiedExpenseType
source: https://github.com/schemaorg/schemaorg/issues/3572

RefurbishedCondition
type: OfferItemCondition
comment: Indicates that the item is refurbished.

Drug
type: Class
equivalent class: http://purl.bioontology.org/ontology/SNOMEDCT/410942007
comment: A chemical or biologic substance, used as a medical therapy, that has a physiological effect on an organism. Here the term drug is used interchangeably with the term medicine although clinical knowledge makes a clear difference between them.
subclass of: Product
subclass of: Substance
isPartOf: health-lifesci.schema.org

DEPublicCharity
type: DENonprofitType
comment: DEPublicCharity: Non-profit type referring to a charitable government owned juridical person (German Körperschaft öffentlichen Rechts) that has been recognized by the tax authorities as a charitable non-profit.
isPartOf: pending.schema.org
source: https://github.com/schemaorg/schemaorg/issues/3629

processorRequirements
type: Property
comment: Processor architecture required to run the application (e.g. IA64).
domainIncludes: SoftwareApplication
rangeIncludes: Text

installUrl
type: Property
comment: URL at which the app may be installed, if different from the URL of the item.
domainIncludes: SoftwareApplication
rangeIncludes: URL

utterances
type: Property
comment: Text of an utterances (spoken words, lyrics etc.) that occurs at a certain section of a media object, represented as a HyperTocEntry.
domainIncludes: HyperTocEntry
isPartOf: pending.schema.org
rangeIncludes: Text
source: https://github.com/schemaorg/schemaorg/issues/2766

orderedItem
type: Property
comment: The item ordered.
sub property of: hasProduct
domainIncludes: OrderItem
domainIncludes: Order
rangeIncludes: Product
rangeIncludes: Service
rangeIncludes: OrderItem

OnlineBusiness
type: Class
comment: A particular online business, either standalone or the online part of a broader organization. Examples include an eCommerce site, an online travel booking site, an online learning site, an online logistics and shipping provider, an online (virtual) doctor, etc.
subclass of: Organization
isPartOf: pending.schema.org
source: https://github.com/schemaorg/schemaorg/issues/3028

ComedyEvent
type: Class
comment: Event type: Comedy event.
subclass of: Event

CertificationStatusEnumeration
type: Class
comment: Enumerates the different statuses of a Certification (Active and Inactive).
subclass of: Enumeration
isPartOf: pending.schema.org
source: https://github.com/schemaorg/schemaorg/issues/3230

HinduDiet
type: RestrictedDiet
comment: A diet conforming to Hindu dietary practices, in particular, beef-free.

numberOfAxles
type: Property
comment: The number of axles.\n\nTypical unit code(s): C62.
contributor: Automotive Ontology Working Group
domainIncludes: Vehicle
rangeIncludes: QuantitativeValue
rangeIncludes: Number

APIReference
type: Class
comment: Reference documentation for application programming interfaces (APIs).
subclass of: TechArticle

billingDuration
type: Property
comment: Specifies for how long this price (or price component) will be billed. Can be used, for example, to model the contractual duration of a subscription or payment plan. Type can be either a Duration or a Number (in which case the unit of measurement, for example month, is specified by the unitCode property).
domainIncludes: UnitPriceSpecification
isPartOf: pending.schema.org
rangeIncludes: QuantitativeValue
rangeIncludes: Number
rangeIncludes: Duration
source: https://github.com/schemaorg/schemaorg/issues/2689

BoatTerminal
type: Class
comment: A terminal for boats, ships, and other water vessels.
subclass of: CivicStructure
isPartOf: pending.schema.org
source: https://github.com/schemaorg/schemaorg/issues/1755

endOffset
type: Property
comment: The end time of the clip expressed as the number of seconds from the beginning of the work.
domainIncludes: Clip
isPartOf: pending.schema.org
rangeIncludes: HyperTocEntry
rangeIncludes: Number
source: https://github.com/schemaorg/schemaorg/issues/2021

CategoryCodeSet
type: Class
comment: A set of Category Code values.
subclass of: DefinedTermSet
isPartOf: pending.schema.org
source: https://github.com/schemaorg/schemaorg/issues/894

MusicAlbumProductionType
type: Class
comment: Classification of the album by its type of content: soundtrack, live album, studio album, etc.
subclass of: Enumeration
contributor: MBZ

TouristTrip
type: Class
comment: A tourist trip. A created itinerary of visits to one or more places of interest (TouristAttraction/TouristDestination) often linked by a similar theme, geographic area, or interest to a particular touristType. The [UNWTO](http://www2.unwto.org/) defines tourism trip as the Trip taken by visitors. (See examples below.)
subclass of: Trip
contributor: IIT-CNR.it
contributor: Tourism
isPartOf: pending.schema.org
source: https://github.com/schemaorg/schemaorg/issues/1810

RadioChannel
type: Class
comment: A unique instance of a radio BroadcastService on a CableOrSatelliteService lineup.
subclass of: BroadcastChannel

SizeGroupEnumeration
type: Class
comment: Enumerates common size groups for various product categories.
subclass of: Enumeration
isPartOf: pending.schema.org
source: https://github.com/schemaorg/schemaorg/issues/2811

AutoRental
type: Class
comment: A car rental business.
subclass of: AutomotiveBusiness

ImageObject
type: Class
equivalent class: Image
comment: An image file.
subclass of: MediaObject

equal
type: Property
comment: This ordering relation for qualitative values indicates that the subject is equal to the object.
contributor: GoodRelationsTerms
domainIncludes: QualitativeValue
rangeIncludes: QualitativeValue

CommentAction
type: Class
comment: The act of generating a comment about a subject.
subclass of: CommunicateAction

legislationDate
type: Property
equivalent property: date document
comment: The date of adoption or signature of the legislation. This is the date at which the text is officially aknowledged to be a legislation, even though it might not even be published or in force.
sub property of: dateCreated
contributor: ELI
domainIncludes: Legislation
isPartOf: pending.schema.org
rangeIncludes: Date
source: https://github.com/schemaorg/schemaorg/issues/1156
source: eli

ComicStory
type: Class
comment: The term "story" is any indivisible, re-printable unit of a comic, including the interior stories, covers, and backmatter. Most comics have at least two stories: a cover (ComicCoverArt) and an interior story.
subclass of: CreativeWork
isPartOf: bib.schema.org

WearableMeasurementChestOrBust
type: WearableMeasurementTypeEnumeration
comment: Measurement of the chest/bust section, for example of a suit.
isPartOf: pending.schema.org
source: https://github.com/schemaorg/schemaorg/issues/2811

ResearchProject
type: Class
comment: A Research project.
subclass of: Project
isPartOf: pending.schema.org
source: FundInfoCollab
source: https://github.com/schemaorg/schemaorg/issues/383

clincalPharmacology
type: Property
comment: Description of the absorption and elimination of drugs, including their concentration (pharmacokinetics, pK) and biological effects (pharmacodynamics, pD).
domainIncludes: Drug
isPartOf: health-lifesci.schema.org
rangeIncludes: Text
supersededBy: clinicalPharmacology

PurchaseTypeTradeIn
type: PurchaseType
comment: This is a trade-in for an item.
isPartOf: pending.schema.org
source: https://github.com/schemaorg/schemaorg/issues/3572

PlayAction
type: Class
comment: The act of playing/exercising/training/performing for enjoyment, leisure, recreation, competition or exercise.\n\nRelated actions:\n\n* ListenAction: Unlike ListenAction (which is under ConsumeAction), PlayAction refers to performing for an audience or at an event, rather than consuming music.\n* WatchAction: Unlike WatchAction (which is under ConsumeAction), PlayAction refers to showing/displaying for an audience or at an event, rather than consuming visual content.
subclass of: Action

latitude
type: Property
comment: The latitude of a location. For example ```37.42242``` ([WGS 84](https://en.wikipedia.org/wiki/World_Geodetic_System)).
sub property of: hasLatitude
domainIncludes: GeoCoordinates
domainIncludes: Place
rangeIncludes: Text
rangeIncludes: Number

ImagingTest
type: Class
comment: Any medical imaging modality typically used for diagnostic purposes.
subclass of: MedicalTest
isPartOf: health-lifesci.schema.org

RestrictedDiet
type: Class
comment: A diet restricted to certain foods or preparations for cultural, religious, health or lifestyle reasons.
subclass of: Enumeration

EPRelease
type: MusicAlbumReleaseType
comment: EPRelease.
contributor: MBZ

healthCondition
type: Property
comment: Specifying the health condition(s) of a patient, medical study, or other target audience.
domainIncludes: PeopleAudience
domainIncludes: MedicalStudy
domainIncludes: Patient
isPartOf: health-lifesci.schema.org
rangeIncludes: MedicalCondition

Property
type: Class
equivalent class: Property
comment: A property, used to indicate attributes and relationships of some Thing; equivalent to rdf:Property.
subclass of: Intangible
isPartOf: meta.schema.org

OfferForLease
type: Class
comment: An OfferForLease in Schema.org represents an Offer to lease out something, i.e. an Offer whose businessFunction is [lease out](http://purl.org/goodrelations/v1#LeaseOut.). See [Good Relations](https://en.wikipedia.org/wiki/GoodRelations) for background on the underlying concepts.
subclass of: Offer
isPartOf: pending.schema.org
source: https://github.com/schemaorg/schemaorg/issues/2348

code
type: Property
comment: A medical code for the entity, taken from a controlled vocabulary or ontology such as ICD-9, DiseasesDB, MeSH, SNOMED-CT, RxNorm, etc.
domainIncludes: MedicalEntity
isPartOf: health-lifesci.schema.org
rangeIncludes: MedicalCode

HomeAndConstructionBusiness
type: Class
comment: A construction business.\n\nA HomeAndConstructionBusiness is a LocalBusiness that provides services around homes and buildings.\n\nAs a LocalBusiness it can be described as a provider of one or more Service\(s).
subclass of: LocalBusiness

ConstraintNode
type: Class
comment: The ConstraintNode type is provided to support usecases in which a node in a structured data graph is described with properties which appear to describe a single entity, but are being used in a situation where they serve a more abstract purpose. A ConstraintNode can be described using constraintProperty and numConstraints. These constraint properties can serve a variety of purposes, and their values may sometimes be understood to indicate sets of possible values rather than single, exact and specific values.
subclass of: Intangible
isPartOf: pending.schema.org
source: https://github.com/schemaorg/schemaorg/issues/2564

touristType
type: Property
comment: Attraction suitable for type(s) of tourist. E.g. children, visitors from a particular country, etc.
contributor: IIT-CNR.it
contributor: Tourism
domainIncludes: TouristDestination
domainIncludes: TouristAttraction
domainIncludes: TouristTrip
rangeIncludes: Text
rangeIncludes: Audience

ratingValue
type: Property
comment: The rating for the content.\n\nUsage guidelines:\n\n* Use values from 0123456789 (Unicode 'DIGIT ZERO' (U+0030) to 'DIGIT NINE' (U+0039)) rather than superficially similar Unicode symbols.\n* Use '.' (Unicode 'FULL STOP' (U+002E)) rather than ',' to indicate a decimal point. Avoid using these symbols as a readability separator.
domainIncludes: Rating
rangeIncludes: Text
rangeIncludes: Number

Credential
type: Class
comment: A credential is a certificate that is used to verify the identity of a person or entity.
subclass of: CreativeWork
isPartOf: pending.schema.org

JobPosting
type: Class
comment: A listing that describes a job opening in a certain organization.
subclass of: Intangible

DataFeedItem
type: Class
comment: A single item within a larger data feed.
subclass of: Intangible

musicalKey
type: Property
comment: The key, mode, or scale this composition uses.
contributor: MBZ
domainIncludes: MusicComposition
rangeIncludes: Text

MonetaryAmountDistribution
type: Class
comment: A statistical distribution of monetary amounts.
subclass of: QuantitativeValueDistribution
source: https://github.com/schemaorg/schemaorg/issues/1698

maps
type: Property
comment: A URL to a map of the place.
domainIncludes: Place
rangeIncludes: URL
supersededBy: hasMap

CategoryCode
type: Class
comment: A Category Code.
subclass of: DefinedTerm
isPartOf: pending.schema.org
source: https://github.com/schemaorg/schemaorg/issues/894

PetStore
type: Class
comment: A pet store.
subclass of: Store

EUEnergyEfficiencyCategoryA2Plus
type: EUEnergyEfficiencyEnumeration
comment: Represents EU Energy Efficiency Class A++ as defined in EU energy labeling regulations.
isPartOf: pending.schema.org
source: https://github.com/schemaorg/schemaorg/issues/2670

actionStatus
type: Property
comment: Indicates the current disposition of the Action.
domainIncludes: Action
rangeIncludes: ActionStatusType

CivicStructure
type: Class
comment: A public structure, such as a town hall or concert hall.
subclass of: Place

toRecipient
type: Property
comment: A sub property of recipient. The recipient who was directly sent the message.
sub property of: recipient
domainIncludes: Message
rangeIncludes: Organization
rangeIncludes: Person
rangeIncludes: ContactPoint
rangeIncludes: Audience

practicesAt
type: Property
comment: A MedicalOrganization where the IndividualPhysician practices.
domainIncludes: IndividualPhysician
isPartOf: pending.schema.org
rangeIncludes: MedicalOrganization
source: https://github.com/schemaorg/schemaorg/issues/3420

isEncodedByBioChemEntity
type: Property
comment: Another BioChemEntity encoding by this one.
domainIncludes: BioChemEntity
inverseOf: encodesBioChemEntity
isPartOf: pending.schema.org
rangeIncludes: Gene
source: Gene

geoContains
type: Property
comment: Represents a relationship between two geometries (or the places they represent), relating a containing geometry to a contained geometry. "a contains b iff no points of b lie in the exterior of a, and at least one point of the interior of b lies in the interior of a". As defined in [DE-9IM](https://en.wikipedia.org/wiki/DE-9IM).
domainIncludes: GeospatialGeometry
domainIncludes: Place
rangeIncludes: Place
rangeIncludes: GeospatialGeometry

AccountingService
type: Class
comment: Accountancy business.\n\nAs a LocalBusiness it can be described as a provider of one or more Service\(s).
subclass of: FinancialService

hasBioChemEntityPart
type: Property
comment: Indicates a BioChemEntity that (in some sense) has this BioChemEntity as a part.
domainIncludes: BioChemEntity
inverseOf: isPartOfBioChemEntity
isPartOf: pending.schema.org
rangeIncludes: BioChemEntity
source: www.bioschemas.org

errorCode
type: Property
comment: Application or platform dependant error code.
domainIncludes: Error
rangeIncludes: StatusEnumeration
rangeIncludes: Integer
rangeIncludes: DefinedTerm
rangeIncludes: Text

serviceOperator
type: Property
comment: The operating organization, if different from the provider. This enables the representation of services that are provided by an organization, but operated by another organization like a subcontractor.
domainIncludes: GovernmentService
rangeIncludes: Organization

modelDate
type: Property
comment: The release date of a vehicle model (often used to differentiate versions of the same make and model).
contributor: Automotive Ontology Working Group
domainIncludes: Vehicle
isPartOf: auto.schema.org
rangeIncludes: Date

includedDataCatalog
type: Property
comment: A data catalog which contains this dataset (this property was previously 'catalog', preferred name is now 'includedInDataCatalog').
domainIncludes: Dataset
rangeIncludes: DataCatalog
supersededBy: includedInDataCatalog

OrganizationRole
type: Class
comment: A subclass of Role used to describe roles within organizations.
subclass of: Role

releaseDate
type: Property
equivalent property: ProductAvailabilityDate
comment: The release date of a product or product model. This can be used to distinguish the exact variant of a product.
contributor: GoodRelationsTerms
domainIncludes: Product
rangeIncludes: Date

lodgingUnitType
type: Property
comment: Textual description of the unit type (including suite vs. room, size of bed, etc.).
domainIncludes: LodgingReservation
rangeIncludes: Text
rangeIncludes: QualitativeValue

UserLikes
type: Class
comment: UserInteraction and its subtypes is an old way of talking about users interacting with pages. It is generally better to use Action-based vocabulary, alongside types such as Comment.
subclass of: UserInteraction
supersededBy: InteractionCounter

RadioStation
type: Class
comment: A radio station.
subclass of: LocalBusiness

skills
type: Property
comment: A statement of knowledge, skill, ability, task or any other assertion expressing a competency that is either claimed by a person, an organization or desired or required to fulfill a role or to work in an occupation.
domainIncludes: JobPosting
domainIncludes: Organization
domainIncludes: Occupation
domainIncludes: Person
rangeIncludes: Text
rangeIncludes: DefinedTerm
source: https://github.com/schemaorg/schemaorg/issues/1698
source: https://github.com/schemaorg/schemaorg/issues/2322

seller
type: Property
equivalent property: Seller
comment: An entity which offers (sells / leases / lends / loans) the services / goods. A seller may also be a provider.
sub property of: hasSupplier
sub property of: participant
domainIncludes: Demand
domainIncludes: Order
domainIncludes: BuyAction
domainIncludes: Offer
domainIncludes: Flight
rangeIncludes: Person
rangeIncludes: Organization

minimumPaymentDue
type: Property
comment: The minimum payment required at this time.
sub property of: hasMonetaryAmount
sub property of: hasLowerBound
domainIncludes: Invoice
rangeIncludes: PriceSpecification
rangeIncludes: MonetaryAmount

sensoryRequirement
type: Property
comment: A description of any sensory requirements and levels necessary to function on the job, including hearing and vision. Defined terms such as those in O*net may be used, but note that there is no way to specify the level of ability as well as its nature when using a defined term.
domainIncludes: JobPosting
isPartOf: pending.schema.org
rangeIncludes: DefinedTerm
rangeIncludes: Text
rangeIncludes: URL
source: https://github.com/schemaorg/schemaorg/issues/2384

RadiationTherapy
type: Class
comment: A process of care using radiation aimed at improving a health condition.
subclass of: MedicalTherapy
isPartOf: health-lifesci.schema.org

isPlanForApartment
type: Property
comment: Indicates some accommodation that this floor plan describes.
domainIncludes: FloorPlan
isPartOf: pending.schema.org
rangeIncludes: Accommodation
source: https://github.com/schemaorg/schemaorg/issues/2373

OneTimePayments
type: GovernmentBenefitsType
comment: OneTimePayments: this is a benefit for one-time payments for individuals.
isPartOf: pending.schema.org
source: https://github.com/schemaorg/schemaorg/issues/2534

EducationEvent
type: Class
comment: Event type: Education event.
subclass of: Event

OccupationalTherapy
type: Class
comment: A treatment of people with physical, emotional, or social problems, using purposeful activity to help them overcome or learn to deal with their problems.
subclass of: MedicalTherapy
isPartOf: health-lifesci.schema.org

recordingOf
type: Property
comment: The composition this track is a recording of.
contributor: MBZ
domainIncludes: MusicRecording
inverseOf: recordedAs
rangeIncludes: MusicComposition

cashBack
type: Property
comment: A cardholder benefit that pays the cardholder a small percentage of their net expenditures.
contributor: FIBO
domainIncludes: PaymentCard
isPartOf: pending.schema.org
rangeIncludes: Number
rangeIncludes: Boolean
source: https://github.com/schemaorg/schemaorg/issues/1253

specialty
type: Property
comment: One of the domain specialities to which this web page's content applies.
domainIncludes: WebPage
rangeIncludes: Specialty

CompositeSyntheticDigitalSource
type: IPTCDigitalSourceEnumeration
comment: Content coded as 'composite synthetic' using the IPTC digital source type vocabulary.
isPartOf: pending.schema.org
source: https://github.com/schemaorg/schemaorg/issues/3392

UnofficialLegalValue
type: LegalValueLevel
comment: Indicates that a document has no particular or special standing (e.g. a republication of a law by a private publisher).
contributor: ELI
isPartOf: pending.schema.org
source: eli
source: https://github.com/schemaorg/schemaorg/issues/1156

tongueWeight
type: Property
comment: The permitted vertical load (TWR) of a trailer attached to the vehicle. Also referred to as Tongue Load Rating (TLR) or Vertical Load Rating (VLR).\n\nTypical unit code(s): KGM for kilogram, LBR for pound\n\n* Note 1: You can indicate additional information in the name of the QuantitativeValue node.\n* Note 2: You may also link to a QualitativeValue node that provides additional information using valueReference.\n* Note 3: Note that you can use minValue and maxValue to indicate ranges.
contributor: Automotive Ontology Working Group
domainIncludes: Vehicle
isPartOf: auto.schema.org
rangeIncludes: QuantitativeValue

FoodEstablishment
type: Class
comment: A food-related business.
subclass of: LocalBusiness

CriticReview
type: Class
comment: A CriticReview is a more specialized form of Review written or published by a source that is recognized for its reviewing activities. These can include online columns, travel and food guides, TV and radio shows, blogs and other independent Web sites. CriticReviews are typically more in-depth and professionally written. For simpler, casually written user/visitor/viewer/customer reviews, it is more appropriate to use the UserReview type. Review aggregator sites such as Metacritic already separate out the site's user reviews from selected critic reviews that originate from third-party sources.
subclass of: Review
isPartOf: pending.schema.org
source: https://github.com/schemaorg/schemaorg/issues/1589

catalog
type: Property
comment: A data catalog which contains this dataset.
domainIncludes: Dataset
rangeIncludes: DataCatalog
supersededBy: includedInDataCatalog

gameItem
type: Property
comment: An item is an object within the game world that can be collected by a player or, occasionally, a non-player character.
domainIncludes: Game
domainIncludes: VideoGameSeries
rangeIncludes: Thing

Taxi
type: Class
comment: A taxi.
subclass of: Service
supersededBy: TaxiService

MadeToOrder
type: ItemAvailability
comment: Indicates that the item is made to order (custom made).

PaymentMethod
type: Class
equivalent class: PaymentMeans
equivalent class: PaymentMechanism
comment: A payment method is a standardized procedure for transferring the monetary amount for a purchase. Payment methods are characterized by the legal and technical structures used, and by the organization or group carrying out the transaction. The following legacy values should be accepted: \n\n* http://purl.org/goodrelations/v1#ByBankTransferInAdvance\n* http://purl.org/goodrelations/v1#ByInvoice\n* http://purl.org/goodrelations/v1#Cash\n* http://purl.org/goodrelations/v1#CheckInAdvance\n* http://purl.org/goodrelations/v1#COD\n* http://purl.org/goodrelations/v1#DirectDebit\n* http://purl.org/goodrelations/v1#GoogleCheckout\n* http://purl.org/goodrelations/v1#PayPal\n* http://purl.org/goodrelations/v1#PaySwarm\n\nStructured values, or [UNCE payment means](https://vocabulary.uncefact.org/PaymentMeans) are recommended or for newer annotations.
subclass of: Intangible
contributor: good-relations-and-schema-org
source: https://github.com/schemaorg/schemaorg/issues/3537

PaymentDeclined
type: PaymentStatusType
comment: The payee received the payment, but it was declined for some reason.

LibrarySystem
type: Class
comment: A LibrarySystem is a collaborative system amongst several libraries.
subclass of: Organization
isPartOf: pending.schema.org
source: https://github.com/schemaorg/schemaorg/issues/1495

partOfEpisode
type: Property
comment: The episode to which this clip belongs.
sub property of: isPartOf
domainIncludes: Clip
rangeIncludes: Episode

Ligament
type: Class
comment: A short band of tough, flexible, fibrous connective tissue that functions to connect multiple bones, cartilages, and structurally support joints.
subclass of: AnatomicalStructure
isPartOf: health-lifesci.schema.org

MedicalProcedure
type: Class
equivalent class: http://purl.bioontology.org/ontology/SNOMEDCT/50731006
comment: A process of care used in either a diagnostic, therapeutic, preventive or palliative capacity that relies on invasive (surgical), non-invasive, or other techniques.
subclass of: MedicalEntity
isPartOf: health-lifesci.schema.org

MinorHumanEditsDigitalSource
type: IPTCDigitalSourceEnumeration
comment: Content coded as 'minor human edits' using the IPTC digital source type vocabulary.
isPartOf: pending.schema.org
source: https://github.com/schemaorg/schemaorg/issues/3392

TrainReservation
type: Class
comment: A reservation for train travel.\n\nNote: This type is for information about actual reservations, e.g. in confirmation emails or HTML pages with individual confirmations of reservations. For offers of tickets, use Offer.
subclass of: Reservation

Quiz
type: Class
comment: Quiz: A test of knowledge, skills and abilities.
subclass of: LearningResource
isPartOf: pending.schema.org
source: https://github.com/schemaorg/schemaorg/issues/2611

WearableSizeSystemAU
type: WearableSizeSystemEnumeration
comment: Australian size system for wearables.
isPartOf: pending.schema.org
source: https://github.com/schemaorg/schemaorg/issues/2811

termsOfService
type: Property
comment: Human-readable terms of service documentation.
domainIncludes: Service
isPartOf: pending.schema.org
rangeIncludes: Text
rangeIncludes: URL
source: https://github.com/schemaorg/schemaorg/issues/1423

afterMedia
type: Property
comment: A media object representing the circumstances after performing this direction.
domainIncludes: HowToDirection
rangeIncludes: MediaObject
rangeIncludes: URL

CatholicChurch
type: Class
comment: A Catholic church.
subclass of: Church

vehicleModelDate
type: Property
comment: The release date of a vehicle model (often used to differentiate versions of the same make and model).
contributor: Automotive Ontology Working Group
domainIncludes: Vehicle
rangeIncludes: Date

DENotRegisteredAssociationCharity
type: DENonprofitType
comment: DENotRegisteredAssociationCharity: Non-profit type referring to a charitable association that is not registered with the German association register (gemeinnütziger Verein) and has been recognized by the tax authorities as a charitable non-profit.
isPartOf: pending.schema.org
source: https://github.com/schemaorg/schemaorg/issues/3629

availabilityEnds
type: Property
comment: The end of the availability of the product or service included in the offer.
contributor: GoodRelationsTerms
domainIncludes: Offer
domainIncludes: ActionAccessSpecification
domainIncludes: Demand
rangeIncludes: DateTime
rangeIncludes: Time
rangeIncludes: Date
source: https://github.com/schemaorg/schemaorg/issues/1741

Obstetric
type: MedicalSpecialty
comment: A specific branch of medical science that specializes in the care of women during the prenatal and postnatal care and with the delivery of the child.
subclass of: MedicalBusiness
isPartOf: health-lifesci.schema.org

VirtualRecordingDigitalSource
type: IPTCDigitalSourceEnumeration
comment: Content coded as 'virtual recording' using the IPTC digital source type vocabulary.
isPartOf: pending.schema.org
source: https://github.com/schemaorg/schemaorg/issues/3392

relatedCondition
type: Property
comment: A medical condition associated with this anatomy.
domainIncludes: AnatomicalSystem
domainIncludes: SuperficialAnatomy
domainIncludes: AnatomicalStructure
isPartOf: health-lifesci.schema.org
rangeIncludes: MedicalCondition

height
type: Property
comment: The height of the item.
domainIncludes: ShippingConditions
domainIncludes: MediaObject
domainIncludes: Person
domainIncludes: Product
domainIncludes: VisualArtwork
domainIncludes: OfferShippingDetails
rangeIncludes: QuantitativeValue
rangeIncludes: Distance
source: https://github.com/schemaorg/schemaorg/issues/3617

firstPerformance
type: Property
comment: The date and place the work was first performed.
contributor: MBZ
domainIncludes: MusicComposition
rangeIncludes: Event

applicationContact
type: Property
comment: Contact details for further information relevant to this job posting.
domainIncludes: JobPosting
isPartOf: pending.schema.org
rangeIncludes: ContactPoint
source: https://github.com/schemaorg/schemaorg/issues/2396

AcceptAction
type: Class
comment: The act of committing to/adopting an object.\n\nRelated actions:\n\n* RejectAction: The antonym of AcceptAction.
subclass of: AllocateAction

Thesis
type: Class
comment: A thesis or dissertation document submitted in support of candidature for an academic degree or professional qualification.
subclass of: CreativeWork
isPartOf: bib.schema.org
source: Thesis

hasParticipationOffer
type: Property
comment: An offer to participate in the event, for example, Call for Proposals, Call for Speakers, or Call for Performers.
domainIncludes: Event
isPartOf: pending.schema.org
rangeIncludes: Offer
source: https://github.com/schemaorg/schemaorg/issues/4495

PhotographAction
type: Class
comment: The act of capturing still images of objects using a camera.
subclass of: CreateAction

successorOf
type: Property
comment: A pointer from a newer variant of a product to its previous, often discontinued predecessor.
contributor: GoodRelationsTerms
domainIncludes: ProductModel
rangeIncludes: ProductModel

Oncologic
type: MedicalSpecialty
comment: A specific branch of medical science that deals with benign and malignant tumors, including the study of their development, diagnosis, treatment and prevention.
subclass of: MedicalBusiness
isPartOf: health-lifesci.schema.org

ineligibleRegion
type: Property
comment: The ISO 3166-1 (ISO 3166-1 alpha-2) or ISO 3166-2 code, the place, or the GeoShape for the geo-political region(s) for which the offer or delivery charge specification is not valid, e.g. a region where the transaction is not allowed.\n\nSee also eligibleRegion.
domainIncludes: MediaObject
domainIncludes: Offer
domainIncludes: ActionAccessSpecification
domainIncludes: DeliveryChargeSpecification
domainIncludes: Demand
isPartOf: pending.schema.org
rangeIncludes: Place
rangeIncludes: Text
rangeIncludes: GeoShape
source: https://github.com/schemaorg/schemaorg/issues/2242

observationAbout
type: Property
comment: The observationAbout property identifies an entity, often a Place, associated with an Observation.
domainIncludes: Observation
isPartOf: pending.schema.org
rangeIncludes: Place
rangeIncludes: Thing
source: https://github.com/schemaorg/schemaorg/issues/2291

MedicalGuidelineRecommendation
type: Class
comment: A guideline recommendation that is regarded as efficacious and where quality of the data supporting the recommendation is sound.
subclass of: MedicalGuideline
isPartOf: health-lifesci.schema.org

HowToDirection
type: Class
comment: A direction indicating a single action to do in the instructions for how to achieve a result.
subclass of: ListItem
subclass of: CreativeWork

AdministrativeArea
type: Class
equivalent class: Subdivision
comment: A geographical region, typically under the jurisdiction of a particular government.
subclass of: Place

exchangeRateSpread
type: Property
comment: The difference between the price at which a broker or other intermediary buys and sells foreign currency.
contributor: FIBO
domainIncludes: ExchangeRateSpecification
isPartOf: pending.schema.org
rangeIncludes: MonetaryAmount
rangeIncludes: Number
source: https://github.com/schemaorg/schemaorg/issues/1253

trainName
type: Property
comment: The name of the train (e.g. The Orient Express).
domainIncludes: TrainTrip
rangeIncludes: Text

GeospatialGeometry
type: Class
comment: (Eventually to be defined as) a supertype of GeoShape designed to accommodate definitions from Geo-Spatial best practices.
subclass of: Intangible
isPartOf: pending.schema.org
source: https://github.com/schemaorg/schemaorg/issues/1375

minValue
type: Property
comment: The lower value of some characteristic or property.
sub property of: hasLowerBound
contributor: GoodRelationsTerms
domainIncludes: MonetaryAmount
domainIncludes: PropertyValue
domainIncludes: PropertyValueSpecification
domainIncludes: QuantitativeValue
rangeIncludes: Number

BusTrip
type: Class
comment: A trip on a commercial bus line.
subclass of: Trip

dropoffLocation
type: Property
comment: Where a rental car can be dropped off.
domainIncludes: RentalCarReservation
rangeIncludes: Place

BookFormatType
type: Class
comment: The publication format of the book.
subclass of: Enumeration

startTime
type: Property
comment: The startTime of something. For a reserved event or service (e.g. FoodEstablishmentReservation), the time that it is expected to start. For actions that span a period of time, when the action was performed. E.g. John wrote a book from *January* to December. For media, including audio and video, it's the time offset of the start of a clip within a larger file.\n\nNote that Event uses startDate/endDate instead of startTime/endTime, even when describing dates with times. This situation may be clarified in future revisions.
domainIncludes: Schedule
domainIncludes: FoodEstablishmentReservation
domainIncludes: Action
domainIncludes: InteractionCounter
domainIncludes: MediaObject
rangeIncludes: DateTime
rangeIncludes: Time
source: https://github.com/schemaorg/schemaorg/issues/2493

administrationRoute
type: Property
comment: A route by which this drug may be administered, e.g. 'oral'.
domainIncludes: Drug
isPartOf: health-lifesci.schema.org
rangeIncludes: Text

ExchangeRateSpecification
type: Class
comment: A structured value representing exchange rate.
subclass of: StructuredValue
contributor: FIBO
isPartOf: pending.schema.org
source: https://github.com/schemaorg/schemaorg/issues/1253

BusOrCoach
type: Class
comment: A bus (also omnibus or autobus) is a road vehicle designed to carry passengers. Coaches are luxury buses, usually in service for long distance travel.
subclass of: Vehicle
contributor: Automotive Ontology Working Group
isPartOf: auto.schema.org

DaySpa
type: Class
comment: A day spa.
subclass of: HealthAndBeautyBusiness

leiCode
type: Property
equivalent property: hasLEI
equivalent property: hasLegalEntityIdentifier
comment: An organization identifier that uniquely identifies a legal entity as defined in ISO 17442.
sub property of: identifier
contributor: GLEIF
contributor: FIBO
domainIncludes: Organization
rangeIncludes: Text

isTierOf
type: Property
comment: The member program this tier is a part of.
domainIncludes: MemberProgramTier
inverseOf: hasTiers
rangeIncludes: MemberProgram
source: https://github.com/schemaorg/schemaorg/issues/3563

Car
type: Class
comment: A car is a wheeled, self-powered motor vehicle used for transportation.
subclass of: Vehicle
contributor: Automotive Ontology Working Group

sampleType
type: Property
comment: What type of code sample: full (compile ready) solution, code snippet, inline code, scripts, template.
domainIncludes: SoftwareSourceCode
rangeIncludes: Text
supersededBy: codeSampleType

Event
type: Class
equivalent class: Event
equivalent class: Occurrence
comment: An event happening at a certain time and location, such as a concert, lecture, or festival. Ticketing information may be added via the offers property. Repeated events may be structured as separate Event objects.
subclass of: Thing

participant
type: Property
comment: Other co-agents that participated in the action indirectly. E.g. John wrote a book with *Steve*.
domainIncludes: Action
rangeIncludes: Organization
rangeIncludes: Person

Withdrawn
type: MedicalStudyStatus
comment: Withdrawn.
isPartOf: health-lifesci.schema.org

assembly
type: Property
comment: Library file name, e.g., mscorlib.dll, system.web.dll.
domainIncludes: APIReference
rangeIncludes: Text
supersededBy: executableLibraryName

bookingAgent
type: Property
comment: 'bookingAgent' is an out-dated term indicating a 'broker' that serves as a booking agent.
domainIncludes: Reservation
rangeIncludes: Organization
rangeIncludes: Person
supersededBy: broker

artform
type: Property
comment: e.g. Painting, Drawing, Sculpture, Print, Photograph, Assemblage, Collage, etc.
domainIncludes: VisualArtwork
rangeIncludes: Text
rangeIncludes: URL

percentile75
type: Property
comment: The 75th percentile value.
domainIncludes: QuantitativeValueDistribution
rangeIncludes: Number
source: https://github.com/schemaorg/schemaorg/issues/1698

recordLabel
type: Property
equivalent property: label
comment: The label that issued the release.
contributor: MBZ
domainIncludes: MusicRelease
rangeIncludes: Organization

colleague
type: Property
comment: A colleague of the person.
domainIncludes: Person
rangeIncludes: Person
rangeIncludes: URL

hasMenuItem
type: Property
comment: A food or drink item contained in a menu or menu section.
domainIncludes: MenuSection
domainIncludes: Menu
rangeIncludes: MenuItem

attendees
type: Property
comment: A person attending the event.
domainIncludes: Event
rangeIncludes: Organization
rangeIncludes: Person
supersededBy: attendee

usNPI
type: Property
comment: A National Provider Identifier (NPI) is a unique 10-digit identification number issued to health care providers in the United States by the Centers for Medicare and Medicaid Services.
sub property of: identifier
domainIncludes: Physician
isPartOf: pending.schema.org
rangeIncludes: Text
source: https://github.com/schemaorg/schemaorg/issues/3420

VisualArtwork
type: Class
comment: A work of art that is primarily visual in character.
subclass of: CreativeWork

musicBy
type: Property
comment: The composer of the soundtrack.
domainIncludes: VideoGameSeries
domainIncludes: VideoObject
domainIncludes: RadioSeries
domainIncludes: TVSeries
domainIncludes: VideoGame
domainIncludes: Episode
domainIncludes: Clip
domainIncludes: Movie
domainIncludes: MovieSeries
rangeIncludes: Person
rangeIncludes: MusicGroup

ArchiveOrganization
type: Class
comment: An organization with archival holdings. An organization which keeps and preserves archival material and typically makes it accessible to the public.
subclass of: LocalBusiness
isPartOf: pending.schema.org
source: https://github.com/schemaorg/schemaorg/issues/1758

distance
type: Property
comment: The distance travelled, e.g. exercising or travelling.
domainIncludes: TravelAction
domainIncludes: ExerciseAction
rangeIncludes: Distance

inStoreReturnsOffered
type: Property
comment: Are in-store returns offered? (For more advanced return methods use the returnMethod property.)
domainIncludes: MerchantReturnPolicy
isPartOf: pending.schema.org
rangeIncludes: Boolean
source: https://github.com/schemaorg/schemaorg/issues/2288

SubwayStation
type: Class
comment: A subway station.
subclass of: CivicStructure

MusicPlaylist
type: Class
comment: A collection of music tracks in playlist form.
subclass of: CreativeWork

performer
type: Property
comment: A performer at the event—for example, a presenter, musician, musical group or actor.
domainIncludes: Event
rangeIncludes: Organization
rangeIncludes: Person

DanceEvent
type: Class
comment: Event type: A social dance.
subclass of: Event

includesHealthPlanNetwork
type: Property
comment: Networks covered by this plan.
domainIncludes: HealthInsurancePlan
isPartOf: pending.schema.org
rangeIncludes: HealthPlanNetwork
source: https://github.com/schemaorg/schemaorg/issues/1062

collectionSize
type: Property
comment: The number of items in the Collection.
domainIncludes: Collection
isPartOf: pending.schema.org
rangeIncludes: Integer
source: https://github.com/schemaorg/schemaorg/issues/1759

parentItem
type: Property
comment: The parent of a question, answer or item in general. Typically used for Q/A discussion threads e.g. a chain of comments with the first comment being an Article or other CreativeWork. See also comment which points from something to a comment about it.
domainIncludes: Question
domainIncludes: Comment
domainIncludes: Answer
rangeIncludes: CreativeWork
rangeIncludes: Comment

additionalNumberOfGuests
type: Property
comment: If responding yes, the number of guests who will attend in addition to the invitee.
domainIncludes: RsvpAction
rangeIncludes: Number

faxNumber
type: Property
equivalent property: faxNumber
comment: The fax number.
domainIncludes: Person
domainIncludes: ContactPoint
domainIncludes: Place
domainIncludes: Organization
rangeIncludes: Text

InStock
type: ItemAvailability
comment: Indicates that the item is in stock.

certificationRating
type: Property
comment: Rating of a certification instance (as defined by an independent certification body). Typically this rating can be used to rate the level to which the requirements of the certification instance are fulfilled. See also [gs1:certificationValue](https://www.gs1.org/voc/certificationValue).
domainIncludes: Certification
isPartOf: pending.schema.org
rangeIncludes: Rating
source: https://github.com/schemaorg/schemaorg/issues/3230

CompositeDigitalSource
type: IPTCDigitalSourceEnumeration
comment: Content coded as 'algorithmic media' using the IPTC digital source type vocabulary.
isPartOf: pending.schema.org
source: https://github.com/schemaorg/schemaorg/issues/3392

DiagnosticProcedure
type: Class
comment: A medical procedure intended primarily for diagnostic, as opposed to therapeutic, purposes.
subclass of: MedicalProcedure
isPartOf: health-lifesci.schema.org

primaryImageOfPage
type: Property
comment: Indicates the main image on the page.
domainIncludes: WebPage
rangeIncludes: ImageObject

ActionAccessSpecification
type: Class
comment: A set of requirements that must be fulfilled in order to perform an Action.
subclass of: Intangible
source: https://github.com/schemaorg/schemaorg/issues/1741

VideoGameSeries
type: Class
comment: A video game series.
subclass of: CreativeWorkSeries

agentInteractionStatistic
type: Property
comment: The number of completed interactions for this entity, in a particular role (the 'agent'), in a particular action (indicated in the statistic), and in a particular context (i.e. interactionService).
domainIncludes: Organization
domainIncludes: Person
isPartOf: pending.schema.org
rangeIncludes: InteractionCounter
source: https://github.com/schemaorg/schemaorg/issues/2858

schemaVersion
type: Property
comment: Indicates (by URL or string) a particular version of a schema used in some CreativeWork. This property was created primarily to indicate the use of a specific schema.org release, e.g. ```10.0``` as a simple string, or more explicitly via URL, ```https://schema.org/docs/releases.html#v10.0```. There may be situations in which other schemas might usefully be referenced this way, e.g. ```http://dublincore.org/specifications/dublin-core/dces/1999-07-02/``` but this has not been carefully explored in the community.
domainIncludes: CreativeWork
rangeIncludes: Text
rangeIncludes: URL

Nonprofit501c23
type: USNonprofitType
comment: Nonprofit501c23: Non-profit type referring to Veterans Organizations.
isPartOf: pending.schema.org
source: https://github.com/schemaorg/schemaorg/issues/2543

resultComment
type: Property
comment: A sub property of result. The Comment created or sent as a result of this action.
sub property of: result
domainIncludes: ReplyAction
domainIncludes: CommentAction
rangeIncludes: Comment

DataCatalog
type: Class
equivalent class: Catalog
comment: A collection of datasets.
subclass of: CreativeWork
contributor: DatasetClass

CausesHealthAspect
type: HealthAspectEnumeration
comment: Information about the causes and main actions that gave rise to the topic.
isPartOf: pending.schema.org
source: https://github.com/schemaorg/schemaorg/issues/2374

isAccessibleForFree
type: Property
comment: A flag to signal that the item, event, or place is accessible for free.
domainIncludes: Event
domainIncludes: Place
domainIncludes: CreativeWork
rangeIncludes: Boolean

PreOrderAction
type: Class
comment: An agent orders a (not yet released) object/product/service to be delivered/sent.
subclass of: TradeAction
source: https://github.com/schemaorg/schemaorg/issues/1125

HyperToc
type: Class
comment: A HyperToc represents a hypertext table of contents for complex media objects, such as VideoObject, AudioObject. Items in the table of contents are indicated using the tocEntry property, and typed HyperTocEntry. For cases where the same larger work is split into multiple files, associatedMedia can be used on individual HyperTocEntry items.
subclass of: CreativeWork
isPartOf: pending.schema.org
source: https://github.com/schemaorg/schemaorg/issues/2766

genre
type: Property
comment: Genre of the creative work, broadcast channel or group.
domainIncludes: CreativeWork
domainIncludes: MusicGroup
domainIncludes: BroadcastChannel
rangeIncludes: Text
rangeIncludes: URL
rangeIncludes: DefinedTerm

isicV4
type: Property
comment: The International Standard of Industrial Classification of All Economic Activities (ISIC), Revision 4 code for a particular organization, business person, or place.
contributor: GoodRelationsTerms
domainIncludes: Organization
domainIncludes: Person
domainIncludes: Place
rangeIncludes: Text

workHours
type: Property
comment: The typical working hours for this job (e.g. 1st shift, night shift, 8am-5pm).
domainIncludes: JobPosting
rangeIncludes: Text

tickerSymbol
type: Property
comment: The exchange traded instrument associated with a Corporation object. The tickerSymbol is expressed as an exchange and an instrument name separated by a space character. For the exchange component of the tickerSymbol attribute, we recommend using the controlled vocabulary of Market Identifier Codes (MIC) specified in ISO 15022.
domainIncludes: Corporation
rangeIncludes: Text

Integer
type: Class
comment: Data type: Integer.
subclass of: Number

WearableSizeSystemMX
type: WearableSizeSystemEnumeration
comment: Mexican size system for wearables.
isPartOf: pending.schema.org
source: https://github.com/schemaorg/schemaorg/issues/2811

tool
type: Property
comment: A sub property of instrument. An object used (but not consumed) when performing instructions or a direction.
sub property of: instrument
domainIncludes: HowToDirection
domainIncludes: HowTo
rangeIncludes: HowToTool
rangeIncludes: Text

partOfSystem
type: Property
comment: The anatomical or organ system that this structure is part of.
domainIncludes: AnatomicalStructure
isPartOf: health-lifesci.schema.org
rangeIncludes: AnatomicalSystem

postOp
type: Property
comment: A description of the postoperative procedures, care, and/or followups for this device.
domainIncludes: MedicalDevice
isPartOf: health-lifesci.schema.org
rangeIncludes: Text

departureStation
type: Property
comment: The station from which the train departs.
domainIncludes: TrainTrip
rangeIncludes: TrainStation

nextItem
type: Property
comment: A link to the ListItem that follows the current one.
domainIncludes: ListItem
rangeIncludes: ListItem

PotentialActionStatus
type: ActionStatusType
comment: A description of an action that is supported.

MusicReleaseFormatType
type: Class
comment: Format of this release (the type of recording media used, i.e. compact disc, digital media, LP, etc.).
subclass of: Enumeration
contributor: MBZ

fileFormat
type: Property
comment: Media type, typically MIME format (see [IANA site](http://www.iana.org/assignments/media-types/media-types.xhtml)) of the content, e.g. application/zip of a SoftwareApplication binary. In cases where a CreativeWork has several media type representations, 'encoding' can be used to indicate each MediaObject alongside particular fileFormat information. Unregistered or niche file formats can be indicated instead via the most appropriate URL, e.g. defining Web page or a Wikipedia entry.
domainIncludes: CreativeWork
rangeIncludes: Text
rangeIncludes: URL
supersededBy: encodingFormat

VinylFormat
type: MusicReleaseFormatType
comment: VinylFormat.
contributor: MBZ

typicalCreditsPerTerm
type: Property
comment: The number of credits or units a full-time student would be expected to take in 1 term however 'term' is defined by the institution.
domainIncludes: EducationalOccupationalProgram
isPartOf: pending.schema.org
rangeIncludes: StructuredValue
rangeIncludes: Integer
source: https://github.com/schemaorg/schemaorg/issues/2419

WearableSizeGroupTall
type: WearableSizeGroupEnumeration
comment: Size group "Tall" for wearables.
isPartOf: pending.schema.org
source: https://github.com/schemaorg/schemaorg/issues/2811

expectedArrivalUntil
type: Property
comment: The latest date the package may arrive.
domainIncludes: ParcelDelivery
rangeIncludes: DateTime
rangeIncludes: Date

GlutenFreeDiet
type: RestrictedDiet
comment: A diet exclusive of gluten.

inLanguage
type: Property
equivalent property: language
comment: The language of the content or performance or used in an action. Please use one of the language codes from the [IETF BCP 47 standard](http://tools.ietf.org/html/bcp47). See also availableLanguage.
domainIncludes: CreativeWork
domainIncludes: WriteAction
domainIncludes: PronounceableText
domainIncludes: BroadcastService
domainIncludes: CommunicateAction
domainIncludes: LinkRole
domainIncludes: Event
rangeIncludes: Text
rangeIncludes: Language
source: https://github.com/schemaorg/schemaorg/issues/2382

RegisterAction
type: Class
comment: The act of registering to be a user of a service, product or web page.\n\nRelated actions:\n\n* JoinAction: Unlike JoinAction, RegisterAction implies you are registering to be a user of a service, *not* a group/team of people.\n* FollowAction: Unlike FollowAction, RegisterAction doesn't imply that the agent is expecting to poll for updates from the object.\n* SubscribeAction: Unlike SubscribeAction, RegisterAction doesn't imply that the agent is expecting updates from the object.
subclass of: InteractAction

Hotel
type: Class
comment: A hotel is an establishment that provides lodging paid on a short-term basis (source: Wikipedia, the free encyclopedia, see http://en.wikipedia.org/wiki/Hotel). See also the dedicated document on the use of schema.org for marking up hotels and other forms of accommodations.
subclass of: LodgingBusiness
contributor: STI Accommodation Ontology

lastReviewed
type: Property
comment: Date on which the content on this web page was last reviewed for accuracy and/or completeness.
domainIncludes: WebPage
rangeIncludes: Date

jobLocationType
type: Property
comment: A description of the job location (e.g. TELECOMMUTE for telecommute jobs).
domainIncludes: JobPosting
isPartOf: pending.schema.org
rangeIncludes: Text
source: https://github.com/schemaorg/schemaorg/issues/1591

availableOnDevice
type: Property
comment: Device required to run the application. Used in cases where a specific make/model is required to run the application.
domainIncludes: SoftwareApplication
rangeIncludes: Text

PhysicalExam
type: Class
comment: A type of physical examination of a patient performed by a physician.
subclass of: MedicalProcedure
subclass of: MedicalEnumeration
isPartOf: health-lifesci.schema.org

TextObject
type: Class
equivalent class: Text
comment: A text file. The text can be unformatted or contain markup, html, etc.
subclass of: MediaObject

hasAdultConsideration
type: Property
comment: Used to tag an item to be intended or suitable for consumption or use by adults only.
domainIncludes: Product
domainIncludes: Offer
isPartOf: pending.schema.org
rangeIncludes: AdultOrientedEnumeration
source: https://github.com/schemaorg/schemaorg/issues/2989

priceComponentType
type: Property
comment: Identifies a price component (for example, a line item on an invoice), part of the total price for an offer.
domainIncludes: UnitPriceSpecification
isPartOf: pending.schema.org
rangeIncludes: PriceComponentTypeEnumeration
source: https://github.com/schemaorg/schemaorg/issues/2689

highPrice
type: Property
comment: The highest price of all offers available.\n\nUsage guidelines:\n\n* Use values from 0123456789 (Unicode 'DIGIT ZERO' (U+0030) to 'DIGIT NINE' (U+0039)) rather than superficially similar Unicode symbols.\n* Use '.' (Unicode 'FULL STOP' (U+002E)) rather than ',' to indicate a decimal point. Avoid using these symbols as a readability separator.
domainIncludes: AggregateOffer
rangeIncludes: Text
rangeIncludes: Number

knows
type: Property
comment: The most generic bi-directional social/work relation.
domainIncludes: Person
rangeIncludes: Person

ITNonprofitType
type: Class
comment: ITNonprofitType: Non-profit organization type originating from Italy.
subclass of: NonprofitType
isPartOf: pending.schema.org
source: https://github.com/schemaorg/schemaorg/issues/3629

modifiedTime
type: Property
comment: The date and time the reservation was modified.
domainIncludes: Reservation
rangeIncludes: DateTime

hasMemberProgram
type: Property
comment: MemberProgram offered by an Organization, for example an eCommerce merchant or an airline.
domainIncludes: Organization
rangeIncludes: MemberProgram
source: https://github.com/schemaorg/schemaorg/issues/3563

CovidTestingFacility
type: Class
comment: A CovidTestingFacility is a MedicalClinic where testing for the COVID-19 Coronavirus disease is available. If the facility is being made available from an established Pharmacy, Hotel, or other non-medical organization, multiple types can be listed. This makes it easier to re-use existing schema.org information about that place, e.g. contact info, address, opening hours. Note that in an emergency, such information may not always be reliable.
subclass of: MedicalClinic
isPartOf: pending.schema.org
source: https://github.com/schemaorg/schemaorg/issues/2490

contactlessPayment
type: Property
comment: A secure method for consumers to purchase products or services via debit, credit or smartcards by using RFID or NFC technology.
contributor: FIBO
domainIncludes: PaymentCard
isPartOf: pending.schema.org
rangeIncludes: Boolean
source: https://github.com/schemaorg/schemaorg/issues/1253

TraditionalChinese
type: MedicineSystem
comment: A system of medicine based on common theoretical concepts that originated in China and evolved over thousands of years, that uses herbs, acupuncture, exercise, massage, dietary therapy, and other methods to treat a wide range of conditions.
isPartOf: health-lifesci.schema.org

trailer
type: Property
comment: The trailer of a movie or TV/radio series, season, episode, etc.
domainIncludes: TVSeries
domainIncludes: Episode
domainIncludes: Movie
domainIncludes: CreativeWorkSeason
domainIncludes: MovieSeries
domainIncludes: VideoGameSeries
domainIncludes: RadioSeries
domainIncludes: VideoGame
rangeIncludes: VideoObject

trialDesign
type: Property
comment: Specifics about the trial design (enumerated).
domainIncludes: MedicalTrial
isPartOf: health-lifesci.schema.org
rangeIncludes: MedicalTrialDesign

salaryCurrency
type: Property
comment: The currency (coded using [ISO 4217](http://en.wikipedia.org/wiki/ISO_4217)) used for the main salary information in this job posting or for this employee.
domainIncludes: JobPosting
domainIncludes: EmployeeRole
rangeIncludes: Text

MedicalTrialDesign
type: Class
comment: Design models for medical trials. Enumerated type.
subclass of: MedicalEnumeration
contributor: WikiDoc
isPartOf: health-lifesci.schema.org

propertyID
type: Property
comment: A commonly used identifier for the characteristic represented by the property, e.g. a manufacturer or a standard code for a property. propertyID can be (1) a prefixed string, mainly meant to be used with standards for product properties; (2) a site-specific, non-prefixed string (e.g. the primary key of the property or the vendor-specific ID of the property), or (3) a URL indicating the type of the property, either pointing to an external vocabulary, or a Web resource that describes the property (e.g. a glossary entry). Standards bodies should promote a standard prefix for the identifiers of properties from their standards.
domainIncludes: PropertyValue
rangeIncludes: Text
rangeIncludes: URL

UserPlusOnes
type: Class
comment: UserInteraction and its subtypes is an old way of talking about users interacting with pages. It is generally better to use Action-based vocabulary, alongside types such as Comment.
subclass of: UserInteraction
supersededBy: InteractionCounter

game
type: Property
comment: Video game which is played on this server.
domainIncludes: GameServer
inverseOf: gameServer
rangeIncludes: VideoGame

DietarySupplement
type: Class
comment: A product taken by mouth that contains a dietary ingredient intended to supplement the diet. Dietary ingredients may include vitamins, minerals, herbs or other botanicals, amino acids, and substances such as enzymes, organ tissues, glandulars and metabolites.
subclass of: Product
subclass of: Substance
isPartOf: health-lifesci.schema.org

numberOfAccommodationUnits
type: Property
comment: Indicates the total (available plus unavailable) number of accommodation units in an ApartmentComplex, or the number of accommodation units for a specific FloorPlan (within its specific ApartmentComplex). See also numberOfAvailableAccommodationUnits.
domainIncludes: FloorPlan
domainIncludes: ApartmentComplex
isPartOf: pending.schema.org
rangeIncludes: QuantitativeValue
source: https://github.com/schemaorg/schemaorg/issues/2373

relatedDrug
type: Property
comment: Any other drug related to this one, for example commonly-prescribed alternatives.
domainIncludes: Drug
isPartOf: health-lifesci.schema.org
rangeIncludes: Drug

DepartAction
type: Class
comment: The act of departing from a place. An agent departs from a fromLocation for a destination, optionally with participants.
subclass of: MoveAction

nerve
type: Property
comment: The underlying innervation associated with the muscle.
domainIncludes: Muscle
isPartOf: health-lifesci.schema.org
rangeIncludes: Nerve

cvdNumC19Died
type: Property
comment: numc19died - DEATHS: Patients with suspected or confirmed COVID-19 who died in the hospital, ED, or any overflow location.
domainIncludes: CDCPMDRecord
isPartOf: pending.schema.org
rangeIncludes: Number
source: https://github.com/schemaorg/schemaorg/issues/2521

HomeGoodsStore
type: Class
comment: A home goods store.
subclass of: Store

RVPark
type: Class
comment: A place offering space for "Recreational Vehicles", Caravans, mobile homes and the like.
subclass of: CivicStructure

Article
type: Class
comment: An article, such as a news article or piece of investigative report. Newspapers and magazines have articles of many different types and this is intended to cover them all.\n\nSee also [blog post](https://blog.schema.org/2014/09/02/schema-org-support-for-bibliographic-relationships-and-periodicals/).
subclass of: CreativeWork
contributor: rNews

BefriendAction
type: Class
comment: The act of forming a personal connection with someone (object) mutually/bidirectionally/symmetrically.\n\nRelated actions:\n\n* FollowAction: Unlike FollowAction, BefriendAction implies that the connection is reciprocal.
subclass of: InteractAction

Time
type: Class
type: DataType
comment: A point in time recurring on multiple days in the form hh:mm:ss[Z|(+|-)hh:mm] (see [XML schema for details](http://www.w3.org/TR/xmlschema-2/#time)).

WearableSizeGroupShort
type: WearableSizeGroupEnumeration
comment: Size group "Short" for wearables.
isPartOf: pending.schema.org
source: https://github.com/schemaorg/schemaorg/issues/2811

pathophysiology
type: Property
comment: Changes in the normal mechanical, physical, and biochemical functions that are associated with this activity or condition.
domainIncludes: MedicalCondition
domainIncludes: PhysicalActivity
isPartOf: health-lifesci.schema.org
rangeIncludes: Text

requiredGender
type: Property
comment: Audiences defined by a person's gender.
domainIncludes: PeopleAudience
rangeIncludes: Text

affectedBy
type: Property
comment: Drugs that affect the test's results.
domainIncludes: MedicalTest
isPartOf: health-lifesci.schema.org
rangeIncludes: Drug

itemListOrder
type: Property
comment: Type of ordering (e.g. Ascending, Descending, Unordered).
domainIncludes: ItemList
rangeIncludes: Text
rangeIncludes: ItemListOrderType

WebPageElement
type: Class
comment: A web page element, like a table or an image.
subclass of: CreativeWork

productionDate
type: Property
equivalent property: ProductionDate
comment: The date of production of the item, e.g. vehicle.
contributor: Automotive Ontology Working Group
domainIncludes: Vehicle
domainIncludes: Product
rangeIncludes: Date

surface
type: Property
comment: A material used as a surface in some artwork, e.g. Canvas, Paper, Wood, Board, etc.
sub property of: material
domainIncludes: VisualArtwork
rangeIncludes: Text
rangeIncludes: URL
supersededBy: artworkSurface

LakeBodyOfWater
type: Class
comment: A lake (for example, Lake Pontrachain).
subclass of: BodyOfWater

SeeDoctorHealthAspect
type: HealthAspectEnumeration
comment: Information about questions that may be asked, when to see a professional, measures before seeing a doctor or content about the first consultation.
isPartOf: pending.schema.org
source: https://github.com/schemaorg/schemaorg/issues/2374

Beach
type: Class
comment: Beach.
subclass of: CivicStructure

Suite
type: Class
comment: A suite in a hotel or other public accommodation, denotes a class of luxury accommodations, the key feature of which is multiple rooms (source: Wikipedia, the free encyclopedia, see http://en.wikipedia.org/wiki/Suite_(hotel)). See also the dedicated document on the use of schema.org for marking up hotels and other forms of accommodations.
subclass of: Accommodation
contributor: STI Accommodation Ontology

hasPOS
type: Property
comment: Points-of-Sales operated by the organization or person.
contributor: GoodRelationsTerms
domainIncludes: Organization
domainIncludes: Person
rangeIncludes: Place

ReturnFeesEnumeration
type: Class
comment: Enumerates several kinds of policies for product return fees.
subclass of: Enumeration
isPartOf: pending.schema.org
source: https://github.com/schemaorg/schemaorg/issues/2288

ItemListOrderDescending
type: ItemListOrderType
comment: An ItemList ordered with higher values listed first.

MultiCenterTrial
type: MedicalTrialDesign
comment: A trial that takes place at multiple centers.
isPartOf: health-lifesci.schema.org

inBroadcastLineup
type: Property
comment: The CableOrSatelliteService offering the channel.
domainIncludes: BroadcastChannel
rangeIncludes: CableOrSatelliteService

TextDigitalDocument
type: Class
comment: A file composed primarily of text.
subclass of: DigitalDocument

pickupLocation
type: Property
comment: Where a taxi will pick up a passenger or a rental car can be picked up.
domainIncludes: TaxiReservation
domainIncludes: RentalCarReservation
rangeIncludes: Place

seatingType
type: Property
comment: The type/class of the seat.
domainIncludes: Seat
rangeIncludes: Text
rangeIncludes: QualitativeValue

Subscription
type: PriceComponentTypeEnumeration
comment: Represents the subscription pricing component of the total price for an offered product.
isPartOf: pending.schema.org
source: https://github.com/schemaorg/schemaorg/issues/2689

Observational
type: MedicalObservationalStudyDesign
comment: An observational study design.
isPartOf: health-lifesci.schema.org

WearableSizeGroupPetite
type: WearableSizeGroupEnumeration
comment: Size group "Petite" for wearables.
isPartOf: pending.schema.org
source: https://github.com/schemaorg/schemaorg/issues/2811

LowSaltDiet
type: RestrictedDiet
comment: A diet focused on reduced sodium intake.

MRI
type: MedicalImagingTechnique
comment: Magnetic resonance imaging.
isPartOf: health-lifesci.schema.org

distinguishingSign
type: Property
comment: One of a set of signs and symptoms that can be used to distinguish this diagnosis from others in the differential diagnosis.
domainIncludes: DDxElement
isPartOf: health-lifesci.schema.org
rangeIncludes: MedicalSignOrSymptom

hasMeasurement
type: Property
comment: A measurement of an item, For example, the inseam of pants, the wheel size of a bicycle, the gauge of a screw, or the carbon footprint measured for certification by an authority. Usually an exact measurement, but can also be a range of measurements for adjustable products, for example belts and ski bindings.
domainIncludes: SizeSpecification
domainIncludes: Certification
domainIncludes: Product
domainIncludes: Offer
isPartOf: pending.schema.org
rangeIncludes: QuantitativeValue
source: https://github.com/schemaorg/schemaorg/issues/2811

representativeOfPage
type: Property
comment: Indicates whether this image is representative of the content of the page.
domainIncludes: ImageObject
rangeIncludes: Boolean

LearningResource
type: Class
comment: The LearningResource type can be used to indicate CreativeWorks (whether physical or digital) that have a particular and explicit orientation towards learning, education, skill acquisition, and other educational purposes. LearningResource is expected to be used as an addition to a primary type such as Book, VideoObject, Product etc. EducationEvent serves a similar purpose for event-like things (e.g. a Trip). A LearningResource may be created as a result of an EducationEvent, for example by recording one.
subclass of: CreativeWork
isPartOf: pending.schema.org
source: https://github.com/schemaorg/schemaorg/issues/1401

Comment
type: Class
comment: A comment on an item - for example, a comment on a blog post. The comment's content is expressed via the text property, and its topic via about, properties shared with all CreativeWorks.
subclass of: CreativeWork

SubscribeAction
type: Class
comment: The act of forming a personal connection with someone/something (object) unidirectionally/asymmetrically to get updates pushed to.\n\nRelated actions:\n\n* FollowAction: Unlike FollowAction, SubscribeAction implies that the subscriber acts as a passive agent being constantly/actively pushed for updates.\n* RegisterAction: Unlike RegisterAction, SubscribeAction implies that the agent is interested in continuing receiving updates from the object.\n* JoinAction: Unlike JoinAction, SubscribeAction implies that the agent is interested in continuing receiving updates from the object.
subclass of: InteractAction

carrier
type: Property
comment: 'carrier' is an out-dated term indicating the 'provider' for parcel delivery and flights.
domainIncludes: Flight
domainIncludes: ParcelDelivery
rangeIncludes: Organization
supersededBy: provider

marginOfError
type: Property
comment: A marginOfError for an Observation.
domainIncludes: Observation
isPartOf: pending.schema.org
rangeIncludes: QuantitativeValue
source: https://github.com/schemaorg/schemaorg/issues/2291

WearableSizeSystemIT
type: WearableSizeSystemEnumeration
comment: Italian size system for wearables.
isPartOf: pending.schema.org
source: https://github.com/schemaorg/schemaorg/issues/2811

HealthClub
type: Class
comment: A health club.
subclass of: HealthAndBeautyBusiness
subclass of: SportsActivityLocation

byArtist
type: Property
comment: The artist that performed this album or recording.
domainIncludes: MusicRecording
domainIncludes: MusicAlbum
rangeIncludes: Person
rangeIncludes: MusicGroup

CarUsageType
type: Class
comment: A value indicating a special usage of a car, e.g. commercial rental, driving school, or as a taxi.
subclass of: Enumeration
contributor: Automotive Ontology Working Group
isPartOf: auto.schema.org

reportNumber
type: Property
comment: The number or other unique designator assigned to a Report by the publishing organization.
domainIncludes: Report
rangeIncludes: Text

physiologicalBenefits
type: Property
comment: Specific physiologic benefits associated to the plan.
domainIncludes: Diet
isPartOf: health-lifesci.schema.org
rangeIncludes: Text

NoteDigitalDocument
type: Class
comment: A file containing a note, primarily for the author.
subclass of: DigitalDocument

eligibilityToWorkRequirement
type: Property
comment: The legal requirements such as citizenship, visa and other documentation required for an applicant to this job.
domainIncludes: JobPosting
isPartOf: pending.schema.org
rangeIncludes: Text
source: https://github.com/schemaorg/schemaorg/issues/2384

bloodSupply
type: Property
comment: The blood vessel that carries blood from the heart to the muscle.
domainIncludes: Muscle
isPartOf: health-lifesci.schema.org
rangeIncludes: Vessel

OriginalMediaContent
type: MediaManipulationRatingEnumeration
comment: Content coded 'as original media content' in a MediaReview, considered in the context of how it was published or shared. For a VideoObject to be 'original': No evidence the footage has been misleadingly altered or manipulated, though it may contain false or misleading claims. For an ImageObject to be 'original': No evidence the image has been misleadingly altered or manipulated, though it may still contain false or misleading claims. For an ImageObject with embedded text to be 'original': No evidence the image has been misleadingly altered or manipulated, though it may still contain false or misleading claims. For an AudioObject to be 'original': No evidence the audio has been misleadingly altered or manipulated, though it may contain false or misleading claims.
isPartOf: pending.schema.org
source: https://github.com/schemaorg/schemaorg/issues/2450

MedicalIndication
type: Class
comment: A condition or factor that indicates use of a medical therapy, including signs, symptoms, risk factors, anatomical states, etc.
subclass of: MedicalEntity
isPartOf: health-lifesci.schema.org

offersPrescriptionByMail
type: Property
comment: Whether prescriptions can be delivered by mail.
domainIncludes: HealthPlanFormulary
isPartOf: pending.schema.org
rangeIncludes: Boolean
source: https://github.com/schemaorg/schemaorg/issues/1062

diversityPolicy
type: Property
comment: Statement on diversity policy by an Organization e.g. a NewsMediaOrganization. For a NewsMediaOrganization, a statement describing the newsroom’s diversity policy on both staffing and sources, typically providing staffing data.
contributor: TP
domainIncludes: Organization
domainIncludes: NewsMediaOrganization
isPartOf: pending.schema.org
rangeIncludes: CreativeWork
rangeIncludes: URL
source: https://github.com/schemaorg/schemaorg/issues/1525

validIn
type: Property
comment: The geographic area where the item is valid. Applies for example to a Permit, a Certification, or an EducationalOccupationalCredential.
domainIncludes: Certification
domainIncludes: Credential
domainIncludes: Permit
rangeIncludes: AdministrativeArea
source: https://github.com/schemaorg/schemaorg/issues/1779

Park
type: Class
comment: A park.
subclass of: CivicStructure

Syllabus
type: Class
comment: A syllabus that describes the material covered in a course, often with several such sections per Course so that a distinct timeRequired can be provided for that section of the Course.
subclass of: LearningResource
isPartOf: pending.schema.org
source: https://github.com/schemaorg/schemaorg/issues/3281

openingHoursSpecification
type: Property
comment: The opening hours of a certain place.
contributor: GoodRelationsTerms
domainIncludes: Place
rangeIncludes: OpeningHoursSpecification

MedicalStudyStatus
type: Class
comment: The status of a medical study. Enumerated type.
subclass of: MedicalEnumeration
isPartOf: health-lifesci.schema.org

RepaymentSpecification
type: Class
comment: A structured value representing repayment.
subclass of: StructuredValue
contributor: FIBO
isPartOf: pending.schema.org
source: https://github.com/schemaorg/schemaorg/issues/1253

sodiumContent
type: Property
comment: The number of milligrams of sodium.
domainIncludes: NutritionInformation
rangeIncludes: Mass

DeactivateAction
type: Class
comment: The act of stopping or deactivating a device or application (e.g. stopping a timer or turning off a flashlight).
subclass of: ControlAction

WritePermission
type: DigitalDocumentPermissionType
comment: Permission to write or edit the document.

productSupported
type: Property
comment: The product or service this support contact point is related to (such as product support for a particular product line). This can be a specific product or product line (e.g. "iPhone") or a general category of products or services (e.g. "smartphones").
domainIncludes: ContactPoint
rangeIncludes: Text
rangeIncludes: Product

Throat
type: PhysicalExam
comment: Throat assessment with clinical examination.
isPartOf: health-lifesci.schema.org

isAccessoryOrSparePartFor
type: Property
comment: A pointer to another product (or multiple products) for which this product is an accessory or spare part.
contributor: GoodRelationsTerms
domainIncludes: Product
rangeIncludes: Product

currency
type: Property
equivalent property: hasCurrency
comment: The currency in which the monetary amount is expressed.\n\nUse standard formats: [ISO 4217 currency format](http://en.wikipedia.org/wiki/ISO_4217), e.g. "USD"; [Ticker symbol](https://en.wikipedia.org/wiki/List_of_cryptocurrencies) for cryptocurrencies, e.g. "BTC"; well known names for [Local Exchange Trading Systems](https://en.wikipedia.org/wiki/Local_exchange_trading_system) (LETS) and other currency types, e.g. "Ithaca HOUR".
domainIncludes: MonetaryAmountDistribution
domainIncludes: DatedMoneySpecification
domainIncludes: LoanOrCredit
domainIncludes: MonetaryAmount
domainIncludes: ExchangeRateSpecification
rangeIncludes: Text
source: https://github.com/schemaorg/schemaorg/issues/1253

DeliveryChargeSpecification
type: Class
comment: The price for the delivery of an offer using a particular delivery method.
subclass of: PriceSpecification
contributor: good-relations-and-schema-org

ClaimReview
type: Class
comment: A fact-checking review of claims made (or reported) in some creative work (referenced via itemReviewed).
subclass of: Review
source: https://github.com/schemaorg/schemaorg/issues/1061

enginePower
type: Property
comment: The power of the vehicle's engine. Typical unit code(s): KWT for kilowatt, BHP for brake horsepower, N12 for metric horsepower (PS, with 1 PS = 735,49875 W)\n\n* Note 1: There are many different ways of measuring an engine's power. For an overview, see [http://en.wikipedia.org/wiki/Horsepower#Engine\_power\_test\_codes](http://en.wikipedia.org/wiki/Horsepower#Engine_power_test_codes).\n* Note 2: You can link to information about how the given value has been determined using the valueReference property.\n* Note 3: You can use minValue and maxValue to indicate ranges.
contributor: Automotive Ontology Working Group
domainIncludes: EngineSpecification
isPartOf: auto.schema.org
rangeIncludes: QuantitativeValue

MedicalCause
type: Class
comment: The causative agent(s) that are responsible for the pathophysiologic process that eventually results in a medical condition, symptom or sign. In this schema, unless otherwise specified this is meant to be the proximate cause of the medical condition, symptom or sign. The proximate cause is defined as the causative agent that most directly results in the medical condition, symptom or sign. For example, the HIV virus could be considered a cause of AIDS. Or in a diagnostic context, if a patient fell and sustained a hip fracture and two days later sustained a pulmonary embolism which eventuated in a cardiac arrest, the cause of the cardiac arrest (the proximate cause) would be the pulmonary embolism and not the fall. Medical causes can include cardiovascular, chemical, dermatologic, endocrine, environmental, gastroenterologic, genetic, hematologic, gynecologic, iatrogenic, infectious, musculoskeletal, neurologic, nutritional, obstetric, oncologic, otolaryngologic, pharmacologic, psychiatric, pulmonary, renal, rheumatologic, toxic, traumatic, or urologic causes; medical conditions can be causes as well.
subclass of: MedicalEntity
isPartOf: health-lifesci.schema.org

PoliceStation
type: Class
comment: A police station.
subclass of: CivicStructure
subclass of: EmergencyService

UnincorporatedAssociationCharity
type: UKNonprofitType
comment: UnincorporatedAssociationCharity: Non-profit type referring to a charitable company that is not incorporated (UK).
isPartOf: pending.schema.org
source: https://github.com/schemaorg/schemaorg/issues/2543

InStorePrepay
type: PaymentMethodType
comment: Payment in advance in some form of shop or kiosk for goods purchased online.

Nerve
type: Class
comment: A common pathway for the electrochemical nerve impulses that are transmitted along each of the axons.
subclass of: AnatomicalStructure
isPartOf: health-lifesci.schema.org

True
type: Boolean
comment: The boolean value true.

MusicEvent
type: Class
comment: Event type: Music event.
subclass of: Event

ActivateAction
type: Class
comment: The act of starting or activating a device or application (e.g. starting a timer or turning on a flashlight).
subclass of: ControlAction

competitor
type: Property
comment: A competitor in a sports event.
domainIncludes: SportsEvent
rangeIncludes: SportsTeam
rangeIncludes: Person

MediaReviewItem
type: Class
comment: Represents an item or group of closely related items treated as a unit for the sake of evaluation in a MediaReview. Authorship etc. apply to the items rather than to the curation/grouping or reviewing party.
subclass of: CreativeWork
isPartOf: pending.schema.org
source: https://github.com/schemaorg/schemaorg/issues/2450

totalTime
type: Property
comment: The total time required to perform instructions or a direction (including time to prepare the supplies), in [ISO 8601 duration format](http://en.wikipedia.org/wiki/ISO_8601).
domainIncludes: HowTo
domainIncludes: HowToDirection
rangeIncludes: Duration

WearableSizeSystemGS1
type: WearableSizeSystemEnumeration
comment: GS1 (formerly NRF) size system for wearables.
isPartOf: pending.schema.org
source: https://github.com/schemaorg/schemaorg/issues/2811

nerveMotor
type: Property
comment: The neurological pathway extension that involves muscle control.
domainIncludes: Nerve
isPartOf: health-lifesci.schema.org
rangeIncludes: Muscle

HowTo
type: Class
comment: Instructions that explain how to achieve a result by performing a sequence of steps.
subclass of: CreativeWork

incentives
type: Property
comment: Description of bonus and commission compensation aspects of the job.
domainIncludes: JobPosting
rangeIncludes: Text
supersededBy: incentiveCompensation

CssSelectorType
type: Class
comment: Text representing a CSS selector.
subclass of: Text
isPartOf: pending.schema.org
source: https://github.com/schemaorg/schemaorg/issues/1672

EatAction
type: Class
comment: The act of swallowing solid objects.
subclass of: ConsumeAction

discount
type: Property
comment: Any discount applied (to an Order).
domainIncludes: Order
rangeIncludes: Text
rangeIncludes: Number

areaServed
type: Property
equivalent property: hasServiceArea
comment: The geographic area where a service or offered item is provided.
domainIncludes: Offer
domainIncludes: DeliveryChargeSpecification
domainIncludes: Demand
domainIncludes: Organization
domainIncludes: ContactPoint
domainIncludes: Service
domainIncludes: FinancialIncentive
rangeIncludes: GeoShape
rangeIncludes: AdministrativeArea
rangeIncludes: Place
rangeIncludes: Text

translator
type: Property
comment: Organization or person who adapts a creative work to different languages, regional differences and technical requirements of a target market, or that translates during some event.
domainIncludes: Event
domainIncludes: CreativeWork
rangeIncludes: Organization
rangeIncludes: Person

checkinTime
type: Property
comment: The earliest someone may check into a lodging establishment.
domainIncludes: LodgingReservation
domainIncludes: LodgingBusiness
rangeIncludes: DateTime
rangeIncludes: Time

BroadcastFrequencySpecification
type: Class
comment: The frequency in MHz and the modulation used for a particular BroadcastService.
subclass of: Intangible
source: https://github.com/schemaorg/schemaorg/issues/1004

EventStatusType
type: Class
comment: EventStatusType is an enumeration type whose instances represent several states that an Event may be in.
subclass of: StatusEnumeration

CancelAction
type: Class
comment: The act of asserting that a future event/action is no longer going to happen.\n\nRelated actions:\n\n* ConfirmAction: The antonym of CancelAction.
subclass of: PlanAction

HowItWorksHealthAspect
type: HealthAspectEnumeration
comment: Content that discusses and explains how a particular health-related topic works, e.g. in terms of mechanisms and underlying science.
isPartOf: pending.schema.org
source: https://github.com/schemaorg/schemaorg/issues/2799

NegativeFilmDigitalSource
type: IPTCDigitalSourceEnumeration
comment: Content coded as 'negative film' using the IPTC digital source type vocabulary.
isPartOf: pending.schema.org
source: https://github.com/schemaorg/schemaorg/issues/3392

discountCode
type: Property
comment: Code used to redeem a discount.
domainIncludes: Order
rangeIncludes: Text

recognizedBy
type: Property
comment: An organization that acknowledges the validity, value or utility of a credential. Note: recognition may include a process of quality assurance or accreditation.
domainIncludes: Credential
isPartOf: pending.schema.org
rangeIncludes: Organization
source: https://github.com/schemaorg/schemaorg/issues/1779

employmentUnit
type: Property
comment: Indicates the department, unit and/or facility where the employee reports and/or in which the job is to be performed.
domainIncludes: JobPosting
isPartOf: pending.schema.org
rangeIncludes: Organization
source: https://github.com/schemaorg/schemaorg/issues/2296

LiveBlogPosting
type: Class
comment: A LiveBlogPosting is a BlogPosting intended to provide a rolling textual coverage of an ongoing event through continuous updates.
subclass of: BlogPosting

UserInteraction
type: Class
comment: UserInteraction and its subtypes is an old way of talking about users interacting with pages. It is generally better to use Action-based vocabulary, alongside types such as Comment.
subclass of: Event
supersededBy: InteractionCounter

RadioEpisode
type: Class
comment: A radio episode which can be part of a series or season.
subclass of: Episode

bioChemSimilarity
type: Property
comment: A similar BioChemEntity, e.g., obtained by fingerprint similarity algorithms.
domainIncludes: BioChemEntity
isPartOf: pending.schema.org
rangeIncludes: BioChemEntity
source: www.bioschemas.org

Clinician
type: MedicalAudienceType
comment: Medical clinicians, including practicing physicians and other medical professionals involved in clinical practice.
isPartOf: health-lifesci.schema.org

iswcCode
type: Property
comment: The International Standard Musical Work Code for the composition.
contributor: MBZ
domainIncludes: MusicComposition
rangeIncludes: Text

SomeProducts
type: Class
comment: A placeholder for multiple similar products of the same kind.
subclass of: Product
contributor: good-relations-and-schema-org

FAQPage
type: Class
comment: A FAQPage is a WebPage presenting one or more "[Frequently asked questions](https://en.wikipedia.org/wiki/FAQ)" (see also QAPage).
subclass of: WebPage
source: https://github.com/schemaorg/schemaorg/issues/1723

Dentistry
type: MedicalSpecialty
comment: A branch of medicine that is involved in the dental care.
isPartOf: health-lifesci.schema.org

DJMixAlbum
type: MusicAlbumProductionType
comment: DJMixAlbum.
contributor: MBZ

countriesSupported
type: Property
comment: Countries for which the application is supported. You can also provide the two-letter ISO 3166-1 alpha-2 country code.
domainIncludes: SoftwareApplication
rangeIncludes: Text

executableLibraryName
type: Property
comment: Library file name, e.g., mscorlib.dll, system.web.dll.
domainIncludes: APIReference
rangeIncludes: Text

MedicalScholarlyArticle
type: Class
comment: A scholarly article in the medical domain.
subclass of: ScholarlyArticle
isPartOf: health-lifesci.schema.org

warrantyScope
type: Property
comment: The scope of the warranty promise.
contributor: GoodRelationsTerms
domainIncludes: WarrantyPromise
rangeIncludes: WarrantyScope

serviceType
type: Property
comment: The type of service being offered, e.g. veterans' benefits, emergency relief, etc.
domainIncludes: Service
rangeIncludes: GovernmentBenefitsType
rangeIncludes: Text

isrcCode
type: Property
comment: The International Standard Recording Code for the recording.
contributor: MBZ
domainIncludes: MusicRecording
rangeIncludes: Text

MayTreatHealthAspect
type: HealthAspectEnumeration
comment: Related topics may be treated by a Topic.
isPartOf: pending.schema.org
source: https://github.com/schemaorg/schemaorg/issues/2374

Occupation
type: Class
comment: A profession, may involve prolonged training and/or a formal qualification.
subclass of: Intangible
source: https://github.com/schemaorg/schemaorg/issues/1698

MediaManipulationRatingEnumeration
type: Class
comment: Codes for use with the mediaAuthenticityCategory property, indicating the authenticity of a media object (in the context of how it was published or shared). In general these codes are not mutually exclusive, although some combinations (such as 'original' versus 'transformed', 'edited' and 'staged') would be contradictory if applied in the same MediaReview. Note that the application of these codes is with regard to a piece of media shared or published in a particular context.
subclass of: Enumeration
isPartOf: pending.schema.org
source: https://github.com/schemaorg/schemaorg/issues/2450

MedicalContraindication
type: Class
comment: A condition or factor that serves as a reason to withhold a certain medical therapy. Contraindications can be absolute (there are no reasonable circumstances for undertaking a course of action) or relative (the patient is at higher risk of complications, but these risks may be outweighed by other considerations or mitigated by other measures).
subclass of: MedicalEntity
isPartOf: health-lifesci.schema.org

performTime
type: Property
comment: The length of time it takes to perform instructions or a direction (not including time to prepare the supplies), in [ISO 8601 duration format](http://en.wikipedia.org/wiki/ISO_8601).
domainIncludes: HowTo
domainIncludes: HowToDirection
rangeIncludes: Duration

totalJobOpenings
type: Property
comment: The number of positions open for this job posting. Use a positive integer. Do not use if the number of positions is unclear or not known.
domainIncludes: JobPosting
isPartOf: pending.schema.org
rangeIncludes: Integer
source: https://github.com/schemaorg/schemaorg/issues/2329

TravelAgency
type: Class
comment: A travel agency.
subclass of: LocalBusiness

DeliveryMethod
type: Class
equivalent class: TransportMethod
comment: A delivery method is a standardized procedure for transferring the product or service to the destination of fulfillment chosen by the customer. Delivery methods are characterized by the means of transportation used, and by the organization or group that is the contracting party for the sending organization or person.\n\nCommonly used values:\n\n* http://purl.org/goodrelations/v1#DeliveryModeDirectDownload\n* http://purl.org/goodrelations/v1#DeliveryModeFreight\n* http://purl.org/goodrelations/v1#DeliveryModeMail\n* http://purl.org/goodrelations/v1#DeliveryModeOwnFleet\n* http://purl.org/goodrelations/v1#DeliveryModePickUp\n* http://purl.org/goodrelations/v1#DHL\n* http://purl.org/goodrelations/v1#FederalExpress\n* http://purl.org/goodrelations/v1#UPS
subclass of: Enumeration
contributor: good-relations-and-schema-org

chemicalComposition
type: Property
comment: The chemical composition describes the identity and relative ratio of the chemical elements that make up the substance.
domainIncludes: ChemicalSubstance
isPartOf: pending.schema.org
rangeIncludes: Text
source: ChemicalSubstance

RsvpResponseMaybe
type: RsvpResponseType
comment: The invitee may or may not attend.

HowToSection
type: Class
comment: A sub-grouping of steps in the instructions for how to achieve a result (e.g. steps for making a pie crust within a pie recipe).
subclass of: CreativeWork
subclass of: ItemList
subclass of: ListItem

includesObject
type: Property
comment: This links to a node or nodes indicating the exact quantity of the products included in an Offer or ProductCollection.
contributor: GoodRelationsTerms
domainIncludes: ProductCollection
domainIncludes: Offer
domainIncludes: Demand
rangeIncludes: TypeAndQuantityNode

EndorsementRating
type: Class
comment: An EndorsementRating is a rating that expresses some level of endorsement, for example inclusion in a "critic's pick" blog, a "Like" or "+1" on a social network. It can be considered the result of an EndorseAction in which the object of the action is rated positively by some agent. As is common elsewhere in schema.org, it is sometimes more useful to describe the results of such an action without explicitly describing the Action. An EndorsementRating may be part of a numeric scale or organized system, but this is not required: having an explicit type for indicating a positive, endorsement rating is particularly useful in the absence of numeric scales as it helps consumers understand that the rating is broadly positive.
subclass of: Rating
source: https://github.com/schemaorg/schemaorg/issues/1293

MusicAlbum
type: Class
comment: A collection of music tracks.
subclass of: MusicPlaylist

guideline
type: Property
comment: A medical guideline related to this entity.
domainIncludes: MedicalEntity
isPartOf: health-lifesci.schema.org
rangeIncludes: MedicalGuideline

legislationDateVersion
type: Property
equivalent property: version date
comment: The point-in-time at which the provided description of the legislation is valid (e.g.: when looking at the law on the 2016-04-07 (= dateVersion), I get the consolidation of 2015-04-12 of the "National Insurance Contributions Act 2015")
contributor: ELI
domainIncludes: Legislation
isPartOf: pending.schema.org
rangeIncludes: Date
source: https://github.com/schemaorg/schemaorg/issues/1156
source: eli

affiliation
type: Property
comment: An organization that this person is affiliated with. For example, a school/university, a club, or a team.
sub property of: memberOf
domainIncludes: Person
rangeIncludes: Organization

titleEIDR
type: Property
comment: An [EIDR](https://eidr.org/) (Entertainment Identifier Registry) identifier representing at the most general/abstract level, a work of film or television. For example, the motion picture known as "Ghostbusters" has a titleEIDR of "10.5240/7EC7-228A-510A-053E-CBB8-J". This title (or work) may have several variants, which EIDR calls "edits". See editEIDR. Since schema.org types like Movie, TVEpisode, TVSeason, and TVSeries can be used for both works and their multiple expressions, it is possible to use titleEIDR alone (for a general description), or alongside editEIDR for a more edit-specific description.
sub property of: identifier
domainIncludes: Movie
domainIncludes: TVSeason
domainIncludes: TVSeries
domainIncludes: TVEpisode
isPartOf: pending.schema.org
rangeIncludes: Text
rangeIncludes: URL
source: https://github.com/schemaorg/schemaorg/issues/2469

ZoneBoardingPolicy
type: BoardingPolicyType
comment: The airline boards by zones of the plane.

Nonprofit501f
type: USNonprofitType
comment: Nonprofit501f: Non-profit type referring to Cooperative Service Organizations.
isPartOf: pending.schema.org
source: https://github.com/schemaorg/schemaorg/issues/2543

nonProprietaryName
type: Property
comment: The generic name of this drug or supplement.
domainIncludes: DietarySupplement
domainIncludes: Drug
isPartOf: health-lifesci.schema.org
rangeIncludes: Text

owns
type: Property
equivalent property: owns
comment: Things owned by the organization or person.
contributor: GoodRelationsTerms
domainIncludes: Organization
domainIncludes: Person
inverseOf: owner
rangeIncludes: Thing
source: https://github.com/schemaorg/schemaorg/issues/4603

endorsee
type: Property
comment: A sub property of participant. The person/organization being supported.
sub property of: participant
domainIncludes: EndorseAction
rangeIncludes: Organization
rangeIncludes: Person

openingHours
type: Property
comment: The general opening hours for a business. Opening hours can be specified as a weekly time range, starting with days, then times per day. Multiple days can be listed with commas ',' separating each day. Day or time ranges are specified using a hyphen '-'.\n\n* Days are specified using the following two-letter combinations: ```Mo```, ```Tu```, ```We```, ```Th```, ```Fr```, ```Sa```, ```Su```.\n* Times are specified using 24:00 format. For example, 3pm is specified as ```15:00```, 10am as ```10:00```. \n* Here is an example: Tuesdays and Thursdays 4-8pm .\n* If a business is open 7 days a week, then it can be specified as Monday through Sunday, all day .
domainIncludes: CivicStructure
domainIncludes: LocalBusiness
rangeIncludes: Text

MerchantReturnUnlimitedWindow
type: MerchantReturnEnumeration
comment: Specifies that there is an unlimited window for product returns.
isPartOf: pending.schema.org
source: https://github.com/schemaorg/schemaorg/issues/2288

merchantReturnDays
type: Property
comment: Specifies either a fixed return date or the number of days (from the delivery date) that a product can be returned. Used when the returnPolicyCategory property is specified as MerchantReturnFiniteReturnWindow.
domainIncludes: MerchantReturnPolicy
domainIncludes: MerchantReturnPolicySeasonalOverride
isPartOf: pending.schema.org
rangeIncludes: Integer
rangeIncludes: Date
rangeIncludes: DateTime
source: https://github.com/schemaorg/schemaorg/issues/2288

numberOfEmployees
type: Property
comment: The number of employees in an organization, e.g. business.
domainIncludes: Organization
domainIncludes: BusinessAudience
rangeIncludes: QuantitativeValue

PawnShop
type: Class
comment: A shop that will buy, or lend money against the security of, personal possessions.
subclass of: Store

prepTime
type: Property
comment: The length of time it takes to prepare the items to be used in instructions or a direction, in [ISO 8601 duration format](http://en.wikipedia.org/wiki/ISO_8601).
domainIncludes: HowToDirection
domainIncludes: HowTo
rangeIncludes: Duration

AllergiesHealthAspect
type: HealthAspectEnumeration
comment: Content about the allergy-related aspects of a health topic.
isPartOf: pending.schema.org
source: https://github.com/schemaorg/schemaorg/issues/2799

LendAction
type: Class
comment: The act of providing an object under an agreement that it will be returned at a later date. Reciprocal of BorrowAction.\n\nRelated actions:\n\n* BorrowAction: Reciprocal of LendAction.
subclass of: TransferAction

PaymentStatusType
type: Class
comment: A specific payment status. For example, PaymentDue, PaymentComplete, etc.
subclass of: StatusEnumeration

GovernmentBenefitsType
type: Class
comment: GovernmentBenefitsType enumerates several kinds of government benefits to support the COVID-19 situation. Note that this structure may not capture all benefits offered.
subclass of: Enumeration
isPartOf: pending.schema.org
source: https://github.com/schemaorg/schemaorg/issues/2534

PhysicalTherapy
type: Class
comment: A process of progressive physical care and rehabilitation aimed at improving a health condition.
subclass of: MedicalTherapy
isPartOf: health-lifesci.schema.org

CleaningFee
type: PriceComponentTypeEnumeration
comment: Represents the cleaning fee part of the total price for an offered product, for example a vacation rental.
isPartOf: pending.schema.org
source: https://github.com/schemaorg/schemaorg/issues/2689

healthPlanDrugTier
type: Property
comment: The tier(s) of drugs offered by this formulary or insurance plan.
domainIncludes: HealthInsurancePlan
domainIncludes: HealthPlanFormulary
isPartOf: pending.schema.org
rangeIncludes: Text
source: https://github.com/schemaorg/schemaorg/issues/1062

healthPlanId
type: Property
comment: The 14-character, HIOS-generated Plan ID number. (Plan IDs must be unique, even across different markets.)
domainIncludes: HealthInsurancePlan
isPartOf: pending.schema.org
rangeIncludes: Text
source: https://github.com/schemaorg/schemaorg/issues/1062

accessibilityControl
type: Property
comment: Identifies input methods that are sufficient to fully control the described resource. Values should be drawn from the [approved vocabulary](https://www.w3.org/2021/a11y-discov-vocab/latest/#accessibilityControl-vocabulary).
domainIncludes: CreativeWork
rangeIncludes: Text

broadcastTimezone
type: Property
comment: The timezone in [ISO 8601 format](http://en.wikipedia.org/wiki/ISO_8601) for which the service bases its broadcasts.
domainIncludes: BroadcastService
rangeIncludes: Text

ownershipFundingInfo
type: Property
comment: For an Organization (often but not necessarily a NewsMediaOrganization), a description of organizational ownership structure; funding and grants. In a news/media setting, this is with particular reference to editorial independence. Note that the funder is also available and can be used to make basic funder information machine-readable.
sub property of: publishingPrinciples
contributor: TP
domainIncludes: Organization
domainIncludes: NewsMediaOrganization
isPartOf: pending.schema.org
rangeIncludes: AboutPage
rangeIncludes: CreativeWork
rangeIncludes: Text
rangeIncludes: URL
source: https://github.com/schemaorg/schemaorg/issues/1525

legislationApplies
type: Property
equivalent property: implements
comment: Indicates that this legislation (or part of a legislation) somehow transfers another legislation in a different legislative context. This is an informative link, and it has no legal value. For legally-binding links of transposition, use the legislationTransposes property. For example an informative consolidated law of a European Union's member state "applies" the consolidated version of the European Directive implemented in it.
contributor: ELI
domainIncludes: Legislation
isPartOf: pending.schema.org
rangeIncludes: Legislation
source: eli
source: https://github.com/schemaorg/schemaorg/issues/1156

BasicIncome
type: GovernmentBenefitsType
comment: BasicIncome: this is a benefit for basic income.
isPartOf: pending.schema.org
source: https://github.com/schemaorg/schemaorg/issues/2534

sport
type: Property
comment: A type of sport (e.g. Baseball).
domainIncludes: SportsOrganization
domainIncludes: SportsEvent
isPartOf: pending.schema.org
rangeIncludes: Text
rangeIncludes: URL
source: https://github.com/schemaorg/schemaorg/issues/1951

RsvpAction
type: Class
comment: The act of notifying an event organizer as to whether you expect to attend the event.
subclass of: InformAction

cvdNumVent
type: Property
comment: numvent - MECHANICAL VENTILATORS: Total number of ventilators available.
domainIncludes: CDCPMDRecord
isPartOf: pending.schema.org
rangeIncludes: Number
source: https://github.com/schemaorg/schemaorg/issues/2521

abstract
type: Property
comment: An abstract is a short description that summarizes a CreativeWork.
domainIncludes: CreativeWork
isPartOf: pending.schema.org
rangeIncludes: Text
source: https://github.com/schemaorg/schemaorg/issues/276

InviteAction
type: Class
comment: The act of asking someone to attend an event. Reciprocal of RsvpAction.
subclass of: CommunicateAction

CreativeWorkSeries
type: Class
comment: A CreativeWorkSeries in schema.org is a group of related items, typically but not necessarily of the same kind. CreativeWorkSeries are usually organized into some order, often chronological. Unlike ItemList which is a general purpose data structure for lists of things, the emphasis with CreativeWorkSeries is on published materials (written e.g. books and periodicals, or media such as TV, radio and games).\n\nSpecific subtypes are available for describing TVSeries, RadioSeries, MovieSeries, BookSeries, Periodical and VideoGameSeries. In each case, the hasPart / isPartOf properties can be used to relate the CreativeWorkSeries to its parts. The general CreativeWorkSeries type serves largely just to organize these more specific and practical subtypes.\n\nIt is common for properties applicable to an item from the series to be usefully applied to the containing group. Schema.org attempts to anticipate some of these cases, but publishers should be free to apply properties of the series parts to the series as a whole wherever they seem appropriate.
subclass of: Series
subclass of: CreativeWork

associatedDisease
type: Property
comment: Disease associated to this BioChemEntity. Such disease can be a MedicalCondition or a URL. If you want to add an evidence supporting the association, please use PropertyValue.
domainIncludes: BioChemEntity
isPartOf: pending.schema.org
rangeIncludes: PropertyValue
rangeIncludes: MedicalCondition
rangeIncludes: URL
source: BioChemEntity

Nursing
type: MedicalSpecialty
comment: A health profession of a person formally educated and trained in the care of the sick or infirm person.
subclass of: MedicalBusiness
isPartOf: health-lifesci.schema.org

educationalLevel
type: Property
comment: The level in terms of progression through an educational or training context. Examples of educational levels include 'beginner', 'intermediate' or 'advanced', and formal sets of level indicators.
domainIncludes: LearningResource
domainIncludes: CreativeWork
domainIncludes: EducationalOccupationalCredential
domainIncludes: EducationEvent
isPartOf: pending.schema.org
rangeIncludes: Text
rangeIncludes: URL
rangeIncludes: DefinedTerm
source: https://github.com/schemaorg/schemaorg/issues/1779

occupationLocation
type: Property
comment: The region/country for which this occupational description is appropriate. Note that educational requirements and qualifications can vary between jurisdictions.
domainIncludes: Occupation
rangeIncludes: AdministrativeArea
source: https://github.com/schemaorg/schemaorg/issues/1698

RejectAction
type: Class
comment: The act of rejecting to/adopting an object.\n\nRelated actions:\n\n* AcceptAction: The antonym of RejectAction.
subclass of: AllocateAction