Comic Book Ontology
type: Ontology
creator: Sean Petiya
description: An OWL ontology and RDF metadata vocabulary for describing comic books and comic book collections.
license: http://creativecommons.org/licenses/by/4.0
dcterms:modified: 2023-03-15
preferred namespace prefix: cbo
version info: 0.16.0

level
type: AnnotationProperty
comment: The level of description associated with a term.

standard
type: AnnotationProperty
comment: A recommended encoding standard or guidelines.

dcterms:created
type: AnnotationProperty

dcterms:issued
type: AnnotationProperty

dcterms:modified
type: AnnotationProperty

preferredNamespacePrefix
type: AnnotationProperty
qlabel: vann:preferredNamespacePrefix
preferred namespace prefix: The preferred namespace prefix to use when using terms from this vocabulary in an XML document.

preferredNamespaceUri
type: AnnotationProperty
qlabel: vann:preferredNamespaceUri
comment: The preferred namespace URI to use when using terms from this vocabulary in an XML document.

label
qlabel: rdfs:label

term status
type: AnnotationProperty
qlabel: vs:term_status
comment: The status of a vocabulary term, expressed as a short symbolic string; known values include 'unstable','testing', 'stable' and 'archaic'.

adaptation
type: ObjectProperty
sub property of: hasVersion
inverse of: adaptation of
domain: Comic
range: CreativeWork
comment: Links a comic to an adaptation.
term status: unstable

adaptation of
type: ObjectProperty
sub property of: isVersionOf
domain: Comic
range: Comic
comment: Links a work to the comic work it is an adaptation of.
term status: unstable

appearance
type: ObjectProperty
domain: Comic
range: Thing
comment: Describes the appearance of a comic universe element within a comic work.
term status: unstable

artist
type: ObjectProperty
sub property of: contributor
domain: Comic
range: Contributor
comment: Associates an artist with a comic work.
term status: unstable

artwork
type: ObjectProperty
inverse of: artwork of
domain: Page
range: Artwork
comment: Links a comic page to its original artwork.
term status: unstable

artwork of
type: ObjectProperty
domain: Artwork
range: Page
comment: Links orginal comic artwork to a page.
term status: unstable

artwork type
type: ObjectProperty
comment: Describes the artwork type of one or more pages of comic art.
term status: unstable

attribute
type: ObjectProperty
domain: PhysicalObject
range: Attribute
comment: Describes a physical attribute of a comic item.
term status: unstable

bagged
type: ObjectProperty
sub property of: attribute
domain: Copy
range: Material
description: Having this property implies that the comic is bagged.
comment: Describes the bag in which a comic is contained.
term status: unstable

balloon
type: ObjectProperty
sub property of: sequence
domain: Sequence
range: Balloon
comment: Links a panel to a comics sequence.
term status: unstable

binding
type: ObjectProperty
sub property of: material
domain: Issue
range: Binding
comment: Describes the binding of a comic issue.
term status: unstable

boarded
type: ObjectProperty
sub property of: attribute
domain: Copy
range: Material
description: Having this property implies that the comic is boarded.
comment: Describes the backing board of a comic.
term status: unstable

box
type: ObjectProperty
sub property of: hasPart
domain: Collection
range: Box
comment: Associates a box with a comic book collection.
term status: unstable

cameo
type: ObjectProperty
sub property of: character
domain: Comic
range: Character
comment: Describes a cameo appearance by a comic character in a comic work.
term status: unstable

caption
type: ObjectProperty
sub property of: sequence
domain: Sequence
range: Caption
comment: Links a caption to a comics sequence.
term status: unstable

character
type: ObjectProperty
sub property of: appearance
domain: Comic
range: Character
comment: Describes the appearance of a comic character in a comic work.
term status: unstable

collected in
type: ObjectProperty
sub property of: reprinted in
inverse of: collects
domain: Issue
range: Issue
comment: Links a comic work to another work that reprints it as part of a comprehensive collection of reprinted material.
term status: unstable

collection
type: ObjectProperty
domain: Collector
range: Collection
comment: Links a collector to a collection.
term status: unstable

collects
type: ObjectProperty
sub property of: reprints
sub property of: hasPart
domain: Issue
range: Issue
comment: Links a comic issue to another work that reprints it as part of a comprehensive collection of reprinted material.
term status: unstable

colorist
type: ObjectProperty
sub property of: contributor
domain: Comic
range: Contributor
comment: Associates a colorist with a comic work.
term status: unstable

comic age
type: ObjectProperty
domain: Comic
range: Comic Age
comment: Associates a comic with an era of comic book history.
term status: unstable

condition
type: ObjectProperty
domain: Copy
range: Condition
comment: Describes the physical condition of a comic item.
term status: unstable

contains
type: ObjectProperty
inverse of: in box
domain: Container
range: Copy
comment: Describes the contents of a box of comics.
term status: unstable

contributor
type: ObjectProperty
sub property of: contributor
domain: Comic
range: Contributor
comment: Associates a contributor with a comic work.
term status: unstable

copy
type: ObjectProperty
inverse of: copy of
domain: Issue
range: Copy
comment: Links a comic issue to a specific copy.
term status: unstable

copy of
type: ObjectProperty
domain: Copy
range: Issue
comment: Links a specific copy to a comic issue.
term status: unstable

copy state
type: ObjectProperty
domain: Copy
range: State
comment: Describes the physical state of a copy of a comic issue.
term status: unstable

country
type: ObjectProperty
domain: Series
range: Thing
comment: Links a comic series to its country of origin.
term status: unstable

cover art
type: ObjectProperty
domain: Issue
range: Page
comment: Describes the cover art of a comic issue.
term status: unstable

cover artist
type: ObjectProperty
sub property of: artist
domain: Comic
range: Contributor
comment: Associates an artist with cover artwork for a comic.
term status: unstable

creator
type: ObjectProperty
sub property of: creator
domain: Comic
domain: Comic Universe
range: Creator
comment: Associates a creator with a comic work.
term status: unstable

distributed by
type: ObjectProperty
domain: Publication
range: Distributor
comment: Links a comic series to a distributor.
term status: unstable

edition
type: ObjectProperty
domain: Issue
range: Edition
comment: Describes the edition of a comic issue.
term status: unstable

editor
type: ObjectProperty
sub property of: contributor
domain: Comic
range: Contributor
comment: Associates an editor with a comic work.
term status: unstable

encased
type: ObjectProperty
sub property of: attribute
domain: Copy
range: Material
description: Having this property implies that the comic is encapsulated.
comment: Describes the case in which a comic is encapsulated.
term status: unstable

event
type: ObjectProperty
domain: Comic
range: Event
comment: Describes a comic universe event depicted in a comic work.
term status: unstable

format
type: ObjectProperty
domain: Publication
range: Format
comment: Describes the format of a comic work.
term status: unstable

genre
type: ObjectProperty
domain: Comic
range: Genre
comment: Describes the genre of a comic work.
term status: unstable

grade
type: ObjectProperty
domain: Copy
range: Grade
comment: Describes the grade assigned to a comic item by a guarantor.
term status: unstable

guaranteed by
type: ObjectProperty
domain: Copy
range: Guarantor
comment: Links a graded copy of a comic issue to a guarantor.
term status: unstable

gutter
type: ObjectProperty
sub property of: sequence
domain: Sequence
range: Gutter
comment: Links a gutter to a comics sequence.
term status: unstable

imprint
type: ObjectProperty
inverse of: imprint of
domain: Publisher
range: Imprint
comment: Associates a comic publisher with an imprint.
term status: unstable

imprint of
type: ObjectProperty
domain: Imprint
range: Publisher
comment: Associates an imprint with a comic publisher.
term status: unstable

in box
type: ObjectProperty
domain: Copy
range: Box
comment: Links a comic item to a box.
term status: unstable

inker
type: ObjectProperty
sub property of: contributor
domain: Comic
range: Contributor
comment: Associates an inker with a comic work.
term status: unstable

issue
type: ObjectProperty
sub property of: hasPart
inverse of: issue of
domain: Volume
range: Issue
comment: Links a volume of comics to an issue.
term status: unstable

issue of
type: ObjectProperty
sub property of: isPartOf
domain: Issue
range: Volume
comment: Links a comic issue to a volume.
term status: unstable

item
type: ObjectProperty
sub property of: hasPart
inverse of: item of
domain: Collection
range: Item
comment: Links a comic book collection to an item.
term status: unstable

item of
type: ObjectProperty
sub property of: isPartOf
domain: Item
range: Collection
comment: Links an item to a comic book collection.
term status: unstable

language
type: ObjectProperty
sub property of: language
domain: Series
range: Thing
comment: Decribes the language of a comic series.
term status: unstable

letterer
type: ObjectProperty
sub property of: contributor
domain: Comic
range: Contributor
comment: Associates a letterer with a comic work.
term status: unstable

material
type: ObjectProperty
domain: PhysicalObject
range: Material
comment: Describes the material of which a physical item is composed.
term status: unstable

object
type: ObjectProperty
sub property of: appearance
domain: Comic
range: Object
comment: Describes the appearance of a comic object in a comic work.
term status: unstable

owner
type: ObjectProperty
domain: Collection
domain: Item
range: Agent
comment: Links an item or collection to the agent that owns it.
term status: unstable

owner of
type: ObjectProperty
domain: Agent
range: Collection
range: Item
comment: Links an agent to an owned item or collection.
term status: unstable

page
type: ObjectProperty
sub property of: sequence
domain: Sequence
range: Page
comment: Links a page to a comics sequence.
term status: unstable

page type
type: ObjectProperty
domain: Page
range: Page Type
comment: Describes the type of one or more comic pages.
term status: unstable

panel
type: ObjectProperty
sub property of: sequence
domain: Sequence
range: Panel
comment: Links a panel to a comics sequence.
term status: unstable

paper
type: ObjectProperty
sub property of: material
domain: Issue
range: Paper
comment: Describes the paper stock of a comic issue.
term status: unstable

penciller
type: ObjectProperty
sub property of: contributor
domain: Comic
range: Contributor
comment: Associates a penciller with a comic work.
term status: unstable

plotter
type: ObjectProperty
sub property of: contributor
comment: Associates a plotter with a comic work.
term status: unstable

preview
type: ObjectProperty
domain: Issue
range: Issue
comment: Links a comic issue to a preview or sample of that work.
term status: unstable

publication frequency
type: ObjectProperty
domain: Volume
range: Frequency
comment: The publication frequency of a comic.
term status: unstable

publisher
type: ObjectProperty
sub property of: publisher
domain: Series
range: Publisher
comment: Links a publisher to a comic publication.
term status: unstable

quality
type: ObjectProperty
domain: PhysicalObject
range: Quality
comment: Describes a distinctive quality of an object.
term status: unstable

rating
type: ObjectProperty
domain: Publication
range: Thing
comment: The rating of a comics publication.
term status: unstable

related
type: ObjectProperty
domain: Comic
range: Thing
comment: Links a comic to a related object.
term status: unstable

reprinted in
type: ObjectProperty
sub property of: hasVersion
inverse of: reprints
domain: Issue
range: Issue
comment: Links a comic issue to a work that reprints it.
term status: unstable

reprints
type: ObjectProperty
sub property of: isVersionOf
domain: Issue
range: Issue
comment: Links a comic to the original work it reprints.
term status: unstable

role
type: ObjectProperty
domain: Contributor
range: Role
comment: Describes the role of a contributor in the creation of a comic work.
term status: unstable

sequence
type: ObjectProperty
sub property of: hasPart
domain: Comic
range: Sequence
comment: Links a sequence to a comic.
term status: unstable

series
type: ObjectProperty
sub property of: hasPart
inverse of: series of
domain: Comic
range: Series
comment: Links a comic to a series.
term status: unstable

series of
type: ObjectProperty
sub property of: isPartOf
domain: Series
range: Publication
comment: Links a series to a comic work.
term status: unstable

state
type: ObjectProperty
domain: Copy
domain: PhysicalObject
range: State
comment: Describes the physical state of a comic item.
term status: unstable

story
type: ObjectProperty
sub property of: sequence
domain: Comic
range: Story
comment: Links a story to a comic.
term status: unstable

story arc
type: ObjectProperty
sub property of: hasPart
inverse of: has story
domain: Story
range: Story
comment: Links a comic story to a story arc.
term status: unstable

has story
type: ObjectProperty
sub property of: isPartOf
domain: Story
range: Story
comment: Connects an individual story to the story arc it is a part of.
term status: unstable

subject
type: ObjectProperty
domain: Story
range: Thing
comment: The subject of a comic story.
term status: unstable

team
type: ObjectProperty
sub property of: appearance
domain: Comic
range: Team
comment: Describes the appearance of a team of comic characters in a comic work.
term status: unstable

translation
type: ObjectProperty
sub property of: hasVersion
inverse of: translation of
domain: Issue
range: Issue
comment: Links a comic issue to a translation.
term status: unstable

translation of
type: ObjectProperty
sub property of: isVersionOf
domain: Issue
range: Issue
comment: Links a comic issue to the issue it is a translation of.
term status: unstable

universe
type: ObjectProperty
domain: Thing
range: Comic Universe
comment: Links a thing to a comic universe.
term status: unstable

universe of
type: ObjectProperty
domain: Comic Universe
range: Comic Universe
comment: Links a comic universe to the universe from which it originates.
term status: unstable

variant
type: ObjectProperty
sub property of: hasVersion
inverse of: variant of
domain: Issue
range: Issue
comment: Links a comic issue to a variant.
term status: unstable

variant of
type: ObjectProperty
sub property of: isVersionOf
domain: Issue
range: Issue
comment: Links a comic issue to the issue it is a variant of.
term status: unstable

volume
type: ObjectProperty
sub property of: hasPart
inverse of: volume of
domain: Series
range: Volume
comment: Links a series to a comic volume.
term status: unstable

volume of
type: ObjectProperty
sub property of: isPartOf
domain: Volume
range: Series
comment: Links a volume to a comic series.
term status: unstable

writer
type: ObjectProperty
sub property of: contributor
domain: Comic
range: Contributor
comment: Associates a writer with a comic work.
term status: unstable

contributor
type: ObjectProperty
description: Used to associate a contributor with any creative work.

alternative title
type: DatatypeProperty
sub property of: alternative
domain: Comic
range: Literal
comment: An alternative title for any comic work.
term status: unstable

CCA
type: DatatypeProperty
domain: Issue
range: boolean
comment: Comics Code Authority (CCA) approved.
term status: unstable

certification number
type: DatatypeProperty
sub property of: identifier
domain: Copy
range: Literal
comment: The certification number assigned to a graded copy of a comic by a guarantor.
term status: unstable

copyright date
type: DatatypeProperty
sub property of: date
domain: Issue
range: Literal
comment: The copyright date of a comic issue.
term status: unstable

cover date
type: DatatypeProperty
sub property of: date
domain: Issue
range: Literal
comment: The cover date of a comic issue.
term status: testing

coverPrice
type: DatatypeProperty
sub property of: price
domain: Issue
range: Literal
comment: The cover price of a comic issue.
term status: unstable

Diamond code
type: DatatypeProperty
sub property of: distributor code
domain: Publication
range: Literal
comment: A Diamond Comic Distributors code.
term status: unstable

distributor code
type: DatatypeProperty
sub property of: identifier
domain: Publication
range: Literal
comment: The distributor code associated with a comics publication.
term status: unstable

end year
type: DatatypeProperty
sub property of: date
domain: Publication
range: Literal
comment: The date a comic ended publication.
term status: unstable

feature
type: DatatypeProperty
domain: Comic
range: Literal
comment: Describes the feature or primary focus of a comic work.
term status: unstable

imprint name
type: DatatypeProperty
sub property of: name
domain: Imprint
range: Literal
comment: The name of a comic imprint.
term status: unstable

indicia frequency
type: DatatypeProperty
domain: Issue
range: Literal
comment: The publication frequency of a comic as printed in the indicia of an issue.
term status: unstable

indicia publisher
type: DatatypeProperty
domain: Issue
range: Literal
comment: The publisher name as printed in the indicia of a comic issue.
term status: unstable

ISBN
type: DatatypeProperty
sub property of: isbn
comment: The ISBN of a comic publication.
term status: unstable

issue count
type: DatatypeProperty
sub property of: topDataProperty
domain: Volume
range: integer
comment: The total number of issues in a volume of comics.

issueNumber
type: DatatypeProperty
sub property of: identifier
domain: Issue
range: Literal
comment: The number of a comic issue.
term status: testing

item number
type: DatatypeProperty
sub property of: identifier
domain: Issue
range: Literal
comment: An unique identifier assigned to a comic item.
term status: unstable

note
type: DatatypeProperty
range: Literal
comment: A note.
term status: unstable

on-sale date
type: DatatypeProperty
sub property of: date
domain: Issue
range: Literal
comment: The date of availability of a comic issue.
term status: testing

page count
type: DatatypeProperty
sub property of: topDataProperty
domain: Document
domain: Story
range: Literal
comment: The number of pages in a comic issue.
term status: unstable

page number
type: DatatypeProperty
domain: Page
range: Literal
comment: The number of a page in a comics document.

price
type: DatatypeProperty
comment: A general price.
term status: unstable

printing
type: DatatypeProperty
type: FunctionalProperty
domain: Issue
range: Literal
comment: The numerical print run of a comic issue.
term status: unstable

publication date
type: DatatypeProperty
sub property of: date
domain: Issue
range: Literal
comment: The date a comic issue was published.
term status: testing

publisher name
type: DatatypeProperty
sub property of: name
domain: Publisher
range: Literal
comment: The name of a comic publisher.
term status: testing

purchase price
type: DatatypeProperty
sub property of: price
domain: Item
range: Literal
comment: The purchase price of a comic item.
term status: unstable

sale price
type: DatatypeProperty
sub property of: price
domain: Item
range: Literal
comment: The sale price of a comic item.
term status: unstable

series title
type: DatatypeProperty
sub property of: title
domain: Series
range: Literal
comment: The title of a comic series.
term status: testing

series year
type: DatatypeProperty
sub property of: start year
domain: Series
range: Literal
comment: The year a comic series began publication.
term status: unstable

start year
type: DatatypeProperty
sub property of: date
domain: Publication
range: Literal
comment: The date a comic began publication.
term status: unstable

story title
type: DatatypeProperty
sub property of: title
domain: Story
range: Literal
comment: The title of a comic story.
term status: unstable

synopsis
type: DatatypeProperty
domain: Story
range: Literal
comment: The synopsis of a comic story.
term status: unstable

tracking
type: DatatypeProperty
domain: Series
range: Literal
comment: Describes the tracking or numbering between comic series.
term status: unstable

UPC
type: DatatypeProperty
sub property of: identifier
domain: Publication
range: Literal
comment: The UPC of a comic publication.
term status: unstable

value
type: DatatypeProperty
domain: Copy
range: Literal
comment: The estimated value of a comic item.
term status: unstable

variance
type: DatatypeProperty
equivalent property: variantCover
domain: Issue
range: Literal
comment: Any variance to the regular manifestation of a comic issue.
term status: unstable

volumeNumber
type: DatatypeProperty
sub property of: identifier
domain: Volume
range: Literal
comment: The unique identifier of a comic volume.
term status: testing

alternative
type: DatatypeProperty
range: Literal
description: Used to indicate an alternative title for a resource.
comment: An alternative title.

description
type: DatatypeProperty
range: Literal
description: Used to provide a description for any resource.
comment: A description.

identifier
type: DatatypeProperty
range: Literal
description: Any unique identifier of a comic resource.
comment: An identifier.

title
type: DatatypeProperty
range: Literal
comment: A title.

name
type: DatatypeProperty
domain: Agent
range: Literal
description: Used to describe the name of an agent.
comment: A name.

SKU
type: DatatypeProperty
domain: Product
range: Literal
description: The SKU of a comics product.

url
type: DatatypeProperty
range: Literal
description: Used to indicate web content related to a resource.
comment: A URL.

Agent
type: Class
subclass of: Thing
comment: A person, organization, or intelligence in a comic universe.
term status: unstable

Artwork
type: Class
subclass of: Item
subclass of: IndividualProduct
comment: Original comic artwork.
term status: unstable

Balloon
type: Class
subclass of: Sequence
comment: A word balloon in a comics sequence containing dialogue, thought, or sound.
term status: unstable

Binding
type: Class
subclass of: Material
comment: A binding method or material used to bind the pages of a comic.
term status: unstable

Box
type: Class
subclass of: Container
comment: A box that contains comic books.
term status: unstable

Building
type: Class
subclass of: Object
comment: A building in a comic universe.
term status: unstable

Caption
type: Class
subclass of: Sequence
comment: A caption containing narration in a comics sequence.
term status: unstable

Character
type: Class
subclass of: Agent
comment: A comic character.
term status: unstable

Collection
type: Class
subclass of: Collection
comment: A collection of comic books and related resources.
term status: unstable

Collector
type: Class
subclass of: Person
comment: A comic book collector.
term status: unstable

Comic
type: Class
subclass of: CreativeWork
comment: A creative work of sequential art: the juxtaposition of text, images, and other pictorial elements to communicate information.
term status: testing

Comic Age
type: Class
subclass of: Intangible
comment: A period of comic book history.
term status: unstable

Comic Universe
type: Class
subclass of: CreativeWork
comment: A comic universe.
term status: unstable

Condition
type: Class
subclass of: Attribute
comment: A physical condition describing an object.
term status: unstable

Container
type: Class
subclass of: PhysicalObject
comment: An object containing comic books.
term status: unstable

Contributor
type: Class
subclass of: Person
comment: An agent contributing to the creation of a comic work.
term status: unstable

Copy
type: Class
subclass of: Issue
subclass of: Item
subclass of: IndividualProduct
comment: A copy of a comic issue.
term status: unstable

Costume
type: Class
subclass of: Object
comment: A comic character's costume.
term status: unstable

Creator
type: Class
subclass of: Person
comment: An agent primarily responsible for the creation of a comic work.
term status: unstable

Distributor
type: Class
subclass of: Organization
comment: An agent responsible for the distribution of a comic publication.
term status: unstable

Document
type: Class
subclass of: Comic
comment: A document composed of the pages in a comics publication.
deprecated: true
term status: deprecated

Edition
type: Class
subclass of: Intangible
comment: An edition of a comic issue.
term status: unstable

Event
type: Class
subclass of: Thing
comment: An event in a comic universe.
term status: unstable

Format
type: Class
subclass of: Intangible
comment: A format in which a comic is embodied.
term status: unstable

Frequency
type: Class
subclass of: Intangible
comment: A frequency with which a comic is published.
term status: unstable

Genre
type: Class
subclass of: Intangible
comment: A comics genre.
term status: unstable

Grade
type: Class
subclass of: Intangible
comment: A grade assigned to a comic item that represents a summary of its condition.
term status: unstable

Guarantor
type: Class
subclass of: Organization
comment: An organization that guarantees the stated condition of a comic book.
term status: unstable

Gutter
type: Class
subclass of: Sequence
comment: The space between panels in a comics sequence.
term status: unstable

Imprint
type: Class
subclass of: Publisher
comment: An imprint or tradename of a comic publisher.
term status: unstable

Issue
type: Class
equivalent class: ComicIssue
subclass of: Publication
subclass of: Product
subclass of: PublicationIssue
comment: An issue of a comic publication.
term status: unstable

Item
type: Class
comment: A physical or digital item.
term status: unstable

Library
type: Class
subclass of: Organization
comment: A physical or digital library containing a collection of comic resources.
term status: unstable

Location
type: Class
subclass of: Thing
comment: A location in a comic universe.
term status: unstable

Material
type: Class
subclass of: Attribute
comment: A material or medium of which an object is composed.
term status: unstable

Museum
type: Class
subclass of: Organization
comment: A physical or digital museum exhibiting a collection of comic resources.
term status: unstable

Object
type: Class
subclass of: Thing
comment: An object in a comic universe.
term status: unstable

Page
type: Class
subclass of: Sequence
comment: A page in a comics sequence.
term status: unstable

Page Type
type: Class
subclass of: Intangible
comment: A type of page appearing in a comic document.
term status: unstable

Panel
type: Class
subclass of: Sequence
comment: A visual frame containing part of a comics sequence.
term status: unstable

Paper
type: Class
subclass of: Material
comment: A paper stock on which a comic is printed.
term status: unstable

Pedigree
type: Class
subclass of: Collection
comment: An exceptional original owner collection of high quality, vintage comic books often containing copies that are considered exemplars of key issues.
term status: unstable

Attribute
type: Class
comment: An physical attribute or property of an item.
term status: unstable

Planet
type: Class
subclass of: Location
comment: A planetary body in a comic universe.
term status: unstable

Plastic
type: Class
subclass of: Material
comment: A plastic of which a supply item is composed.
term status: unstable

Publication
type: Class
subclass of: Comic
comment: A comics publication.
term status: unstable

Publisher
type: Class
subclass of: Organization
comment: An agent responsible for the publication of a comic.
term status: unstable

Quality
type: Class
subclass of: Attribute
comment: A distinctive quality belonging to an object.
term status: unstable

Role
type: Class
subclass of: Intangible
comment: A creative role in the production of a comic work.
term status: unstable

Sequence
type: Class
subclass of: Comic
comment: A sequence of juxtaposed panels, text, and other pictorial elements.
term status: unstable

Series
type: Class
equivalent class: ComicSeries
subclass of: Publication
subclass of: Periodical
comment: A comic publication containing one or more volumes and issues.
term status: unstable

State
type: Class
subclass of: Attribute
comment: A physical state describing an object.
term status: unstable

Story
type: Class
equivalent class: ComicStory
subclass of: Sequence
comment: A comics story.
term status: unstable

Team
type: Class
subclass of: Agent
comment: A group of comic characters.
term status: unstable

Thing
type: Class
subclass of: Comic Universe
comment: A thing in a comic universe.
term status: unstable

Vehicle
type: Class
subclass of: Object
comment: A vehicle in a comic universe.
term status: unstable

Volume
type: Class
subclass of: Publication
subclass of: PublicationVolume
comment: A single issue or group of issues published in a comic series.
term status: unstable

Collection
type: Class
qlabel: dctype:Collection

PhysicalObject
type: Class
qlabel: dctype:PhysicalObject

CreativeWork
type: Class
qlabel: schema:CreativeWork

IndividualProduct
type: Class
subclass of: Product
qlabel: schema:IndividualProduct

Intangible
type: Class
qlabel: schema:Intangible

Organization
type: Class
subclass of: Agent
qlabel: schema:Organization
comment: An organization.

Periodical
type: Class
subclass of: CreativeWork
qlabel: schema:Periodical

Person
type: Class
subclass of: Agent
qlabel: schema:Person
comment: A person.

Product
type: Class
qlabel: schema:Product

PublicationIssue
type: Class
subclass of: CreativeWork
qlabel: schema:PublicationIssue

PublicationVolume
type: Class
subclass of: CreativeWork
qlabel: schema:PublicationVolume

Agent
type: Class
qlabel: foaf:Agent
comment: An agent.

Sean Petiya
type: NamedIndividual